From dekks, 2 Weeks ago, written in Plain Text.
This paste will croak in 1 Second.
This paste is a reply to qutebrowser metapaste from The Compiler
- view diff
Embed
  1. ========== Report ==========
  2.  
  3.  
  4.  
  5. ========== Contact ==========
  6.  
  7. dekkzz76@gmail.com
  8.  
  9. ========== Debug log ==========
  10.  
  11. ==== Exception ====
  12. Traceback (most recent call last):
  13.   File "/usr/lib/python3/dist-packages/qutebrowser/app.py", line 493, in on_last_window_closed
  14.     self.shutdown(last_window=True)
  15.   File "/usr/lib/python3/dist-packages/qutebrowser/app.py", line 673, in shutdown
  16.     self._shutdown(status, restart=restart)
  17.   File "/usr/lib/python3/dist-packages/qutebrowser/app.py", line 726, in _shutdown
  18.     objreg.get('session-manager').delete_autosave()
  19.   File "/usr/lib/python3/dist-packages/qutebrowser/misc/sessions.py", line 312, in delete_autosave
  20.     self.delete('_autosave')
  21.   File "/usr/lib/python3/dist-packages/qutebrowser/misc/sessions.py", line 403, in delete
  22.     os.remove(path)
  23. OSError: [Errno 30] Read-only file system: '/home/dekks/.local/share/qutebrowser/sessions/_autosave.yml'
  24.  
  25.  
  26. ==== Timestamps ====
  27. Launch: Sun Oct  1 10:19:22 2017
  28. Crash: Sun Oct  1 10:57:40 2017
  29.  
  30. ==== Version info ====
  31. qutebrowser v0.10.1
  32. Git commit:
  33. Backend: QtWebKit
  34.  
  35. CPython: 3.5.3
  36. Qt: 5.7.1
  37. PyQt: 5.7
  38.  
  39. sip: 4.18.1
  40. colorama: no
  41. pypeg2: 2.15
  42. jinja2: 2.8
  43. pygments: 2.2.0
  44. yaml: 3.12
  45. cssutils: no
  46. typing: yes
  47. PyQt5.QtWebEngineWidgets: yes
  48. pdf.js: no
  49. Webkit: 538.1
  50. SSL: OpenSSL 1.0.2l  25 May 2017
  51.  
  52. Style: QFusionStyle
  53. Platform: Linux-4.9.0-3-686-i686-with-debian-9.1, 32bit
  54. Frozen: False
  55. Imported from /usr/lib/python3/dist-packages/qutebrowser
  56. Qt library executable path: /usr/lib/i386-linux-gnu/qt5/libexec, data path: /usr/share/qt5
  57. OS Version:
  58.  
  59. --- /etc/os-release ---
  60. PRETTY_NAME="Debian GNU/Linux 9 (stretch)"
  61. NAME="Debian GNU/Linux"
  62. VERSION_ID="9"
  63. VERSION="9 (stretch)"
  64. ID=debian
  65.  
  66. Paths:
  67. data: /home/dekks/.local/share/qutebrowser
  68. cache: /home/dekks/.cache/qutebrowser
  69. system_data: /usr/share/qutebrowser
  70. runtime: /run/user/1000/qutebrowser
  71. download: /home/dekks/Downloads
  72. config: /home/dekks/.config/qutebrowser
  73.  
  74. ==== Config ====
  75. [network]
  76. accept-language = en-GB,en
  77. user-agent = Mozilla/5.0 (X11; Linux i686; rv:53.0) Gecko/20100101 Firefox/53.0
  78.  
  79. ==== Environment ====
  80. DESKTOP_SESSION = spectrwm
  81. LANG = en_GB.UTF-8
  82. PATH = /usr/local/bin:/usr/bin:/bin:/usr/local/games:/usr/games
  83. QT_ACCESSIBILITY = 1
  84. QT_LINUX_ACCESSIBILITY_ALWAYS_ON = 1
  85. QT_XCB_FORCE_SOFTWARE_OPENGL = 1
  86. XDG_GREETER_DATA_DIR = /var/lib/lightdm/data/dekks
  87. XDG_RUNTIME_DIR = /run/user/1000
  88. XDG_SEAT = seat0
  89. XDG_SEAT_PATH = /org/freedesktop/DisplayManager/Seat0
  90. XDG_SESSION_DESKTOP = spectrwm
  91. XDG_SESSION_ID = 2
  92. XDG_SESSION_PATH = /org/freedesktop/DisplayManager/Session0
  93. XDG_SESSION_TYPE = x11
  94. XDG_VTNR = 7
  95.  
  96. ==== Commandline args ====
  97.  
  98.  
  99. ==== Open Pages ====
  100.  
  101.  
  102. ==== Command history ====
  103. :quickmark-load -t DDG
  104. :quickmark-load DDG
  105. :quickmark-load -t DDG
  106. :quickmark-load Reddit
  107. :quickmark-load -t DDG
  108.  
  109. ==== Objects ====
  110.  
  111. Qt widgets - 45 objects:
  112.     <PyQt5.QtWidgets.QDesktopWidget object at 0x94eca854>
  113.     <PyQt5.QtWidgets.QHeaderView object at 0x94eca7c4>
  114.     <PyQt5.QtWidgets.QLineEdit object at 0x94eca4ac>
  115.     <PyQt5.QtWidgets.QLineEdit object at 0x94eca734>
  116.     <PyQt5.QtWidgets.QScrollBar object at 0x94eca53c>
  117.     <PyQt5.QtWidgets.QScrollBar object at 0x94eca5cc>
  118.     <PyQt5.QtWidgets.QScrollBar object at 0x94eca6ec>
  119.     <PyQt5.QtWidgets.QScrollBar object at 0x94eca77c>
  120.     <PyQt5.QtWidgets.QScrollBar object at 0x94ecaa04>
  121.     <PyQt5.QtWidgets.QScrollBar object at 0x98cfcd64>
  122.     <PyQt5.QtWidgets.QStackedWidget object at 0x95ff438c>
  123.     <PyQt5.QtWidgets.QToolButton object at 0x94eca9bc>
  124.     <PyQt5.QtWidgets.QToolButton object at 0x95ff4344>
  125.     <PyQt5.QtWidgets.QWidget object at 0x94eca4f4>
  126.     <PyQt5.QtWidgets.QWidget object at 0x94eca584>
  127.     <PyQt5.QtWidgets.QWidget object at 0x94eca614>
  128.     <PyQt5.QtWidgets.QWidget object at 0x94eca65c>
  129.     <PyQt5.QtWidgets.QWidget object at 0x94eca6a4>
  130.     <PyQt5.QtWidgets.QWidget object at 0x94eca80c>
  131.     <PyQt5.QtWidgets.QWidget object at 0x94eca89c>
  132.     <PyQt5.QtWidgets.QWidget object at 0x94eca8e4>
  133.     <PyQt5.QtWidgets.QWidget object at 0x94eca92c>
  134.     <PyQt5.QtWidgets.QWidget object at 0x94eca974>
  135.     <qutebrowser.browser.downloadview.DownloadView count=0>
  136.     <qutebrowser.browser.webkit.webkittab.WebKitTab tab_id=0 url='https://www.reddit.com/r/corgi/comments/73fdn8/we_lost_gizmo_to_cancer_today_you_brightened_our/?ut…'>
  137.     <qutebrowser.browser.webkit.webkittab.WebKitTab tab_id=1 url='https://kb.iu.edu/d/abue'>
  138.     <qutebrowser.browser.webkit.webview.WebView tab_id=0 url='https://www.reddit.com/r/corgi/comments/73fdn8/we_lost_gizmo_to_cancer_today_you_brightened_our/?ut…'>
  139.     <qutebrowser.browser.webkit.webview.WebView tab_id=1 url='https://kb.iu.edu/d/abue'>
  140.     <qutebrowser.completion.completionwidget.CompletionView>
  141.     <qutebrowser.mainwindow.mainwindow.MainWindow>
  142.     <qutebrowser.mainwindow.messageview.Message object at 0x95ff46ec>
  143.     <qutebrowser.mainwindow.messageview.Message object at 0x95ff47c4>
  144.     <qutebrowser.mainwindow.messageview.MessageView object at 0x9e93b14c>
  145.     <qutebrowser.mainwindow.prompt.PromptContainer win_id=0>
  146.     <qutebrowser.mainwindow.statusbar.bar.StatusBar>
  147.     <qutebrowser.mainwindow.statusbar.command.Command>
  148.     <qutebrowser.mainwindow.statusbar.keystring.KeyString text=''>
  149.     <qutebrowser.mainwindow.statusbar.percentage.Percentage text='[top]'>
  150.     <qutebrowser.mainwindow.statusbar.progress.Progress value=100>
  151.     <qutebrowser.mainwindow.statusbar.tabindex.TabIndex text='[0/0]'>
  152.     <qutebrowser.mainwindow.statusbar.text.Text text=''>
  153.     <qutebrowser.mainwindow.statusbar.url.UrlText text='https://www.reddit.com/r/corgi/comments/73fdn8/we_lost_gizmo_to_cancer_today_you_brightened_our/?utm_content=title&utm_medium=hot&utm_source=reddit&utm_name=frontpage'>
  154.     <qutebrowser.mainwindow.tabbedbrowser.TabbedBrowser count=0>
  155.     <qutebrowser.mainwindow.tabwidget.TabBar count=0>
  156.     <qutebrowser.misc.keyhintwidget.KeyHintView win_id=0>
  157.  
  158. Qt objects - 27 objects:
  159.     <PyQt5.QtCore.QAbstractEventDispatcher object at 0x95ff438c>
  160.     <PyQt5.QtGui.QSessionManager object at 0x95ff4344>
  161.     <qutebrowser.misc.crashsignal.CrashHandler object at 0xa4a23b6c>
  162.     <qutebrowser.misc.crashsignal.SignalHandler object at 0xa4a28224>
  163.         <PyQt5.QtCore.QSocketNotifier object at 0xa4a2826c>
  164.     <qutebrowser.misc.savemanager.SaveManager saveables=OrderedDict([('version', <qutebrowser.misc.savemanager.Saveable config_opt=None dirty=False filename=None name='version' save_handler=<function _save_version at 0xa4a23a04> save_on_exit=True>), ('config', <qutebrowser.misc.savemanager.Saveable config_opt=('general', 'auto-save-config') dirty=False filename='/home/dekks/.config/qutebrowser/qutebrowser.conf' name='config' save_handler=<bound method ConfigManager.save of <qutebrowser.config.config.ConfigManager fname='qutebrowser.conf'>> save_on_exit=False>), ('key-config', <qutebrowser.misc.savemanager.Saveable config_opt=('general', 'auto-save-config') dirty=False filename='/home/dekks/.config/qutebrowser/keys.conf' name='key-config' save_handler=<bound method KeyConfigParser.save of qutebrowser.config.parsers.keyconf.KeyConfigParser(configfile='/home/dekks/.config/qutebrowser/keys.conf')> save_on_exit=False>), ('state-config', <qutebrowser.misc.savemanager.Saveable config_opt=None dirty=False filename=None name='state-config' save_handler=<bound method ReadWriteConfigParser.save of qutebrowser.config.parsers.ini.ReadWriteConfigParser(configdir='/home/dekks/.local/share/qutebrowser', fname='state')> save_on_exit=True>), ('command-history', <qutebrowser.misc.savemanager.Saveable config_opt=None dirty=False filename=None name='command-history' save_handler=<bound method LimitLineParser.save of qutebrowser.misc.lineparser.LimitLineParser(binary=False, configdir='/home/dekks/.local/share/qutebrowser', fname='cmd-history', limit=('completion', 'cmd-history-max-items'))> save_on_exit=False>), ('history', <qutebrowser.misc.savemanager.Saveable config_opt=None dirty=True filename=None name='history' save_handler=<bound method WebHistory.save of <qutebrowser.browser.history.WebHistory length=2195>> save_on_exit=False>), ('quickmark-manager', <qutebrowser.misc.savemanager.Saveable config_opt=None dirty=False filename='/home/dekks/.config/qutebrowser/quickmarks' name='quickmark-manager' save_handler=<bound method UrlMarkManager.save of <qutebrowser.browser.urlmarks.QuickmarkManager object at 0x9e9efb6c>> save_on_exit=False>), ('bookmark-manager', <qutebrowser.misc.savemanager.Saveable config_opt=None dirty=False filename='/home/dekks/.config/qutebrowser/bookmarks/urls' name='bookmark-manager' save_handler=<bound method UrlMarkManager.save of <qutebrowser.browser.urlmarks.BookmarkManager object at 0x9e94b1dc>> save_on_exit=False>), ('cookies', <qutebrowser.misc.savemanager.Saveable config_opt=('content', 'cookies-store') dirty=True filename=None name='cookies' save_handler=<bound method CookieJar.save of <qutebrowser.browser.webkit.cookies.CookieJar count=276>> save_on_exit=False>)])>
  165.     <qutebrowser.config.config.ConfigManager fname='qutebrowser.conf'>
  166.         qutebrowser.misc.lineparser.LimitLineParser(binary=False, configdir='/home/dekks/.local/share/qutebrowser', fname='cmd-history', limit=('completion', 'cmd-history-max-items'))
  167.     qutebrowser.config.parsers.keyconf.KeyConfigParser(configfile='/home/dekks/.config/qutebrowser/keys.conf')
  168.     <qutebrowser.browser.history.WebHistory length=2195>
  169.         qutebrowser.misc.lineparser.AppendLineParser(binary=False, configdir='/home/dekks/.local/share/qutebrowser', fname='history')
  170.         <qutebrowser.browser.webkit.webkithistory.WebHistoryInterface object at 0xa4a288e4>
  171.     <qutebrowser.misc.sessions.SessionManager object at 0xa4a28bb4>
  172.     <qutebrowser.browser.urlmarks.QuickmarkManager object at 0x9e9efb6c>
  173.         qutebrowser.misc.lineparser.LineParser(binary=False, configdir='/home/dekks/.config/qutebrowser', fname='quickmarks')
  174.     <qutebrowser.browser.urlmarks.BookmarkManager object at 0x9e94b1dc>
  175.         qutebrowser.misc.lineparser.LineParser(binary=False, configdir='/home/dekks/.config/qutebrowser', fname='bookmarks/urls')
  176.     <qutebrowser.browser.webkit.cookies.RAMCookieJar count=0>
  177.     <qutebrowser.browser.webkit.network.webkitqutescheme.JSBridge object at 0x9e94b9bc>
  178.     <qutebrowser.app.EventFilter object at 0x9e905c44>
  179.     <PyQt5.QtCore.QObject object at 0x94ecad1c>
  180.         <PyQt5.QtWidgets.QPanGesture object at 0x94ecacd4>
  181.         <PyQt5.QtWidgets.QPanGesture object at 0x94ecac8c>
  182.         <PyQt5.QtWidgets.QPanGesture object at 0x94ecabfc>
  183.     <qutebrowser.browser.webkit.cookies.CookieJar count=276>
  184.         qutebrowser.misc.lineparser.LineParser(binary=True, configdir='/home/dekks/.local/share/qutebrowser', fname='cookies')
  185.     <qutebrowser.browser.webkit.cache.DiskCache maxsize=52428800 path='/home/dekks/.cache/qutebrowser/http/' size=16254444>
  186.  
  187. global object registry - 26 objects:
  188.     prompt-queue: <qutebrowser.mainwindow.prompt.PromptQueue loops=0 question=None queue=0>
  189.     app: <qutebrowser.app.Application>
  190.     quickmark-manager: <qutebrowser.browser.urlmarks.QuickmarkManager object at 0x9e9efb6c>
  191.     readline-bridge: <qutebrowser.misc.readline.ReadlineBridge>
  192.     bookmark-manager: <qutebrowser.browser.urlmarks.BookmarkManager object at 0x9e94b1dc>
  193.     cache: <qutebrowser.browser.webkit.cache.DiskCache maxsize=52428800 path='/home/dekks/.cache/qutebrowser/http/' size=16254444>
  194.     signal-handler: <qutebrowser.misc.crashsignal.SignalHandler object at 0xa4a28224>
  195.     macro-recorder: <qutebrowser.keyinput.macros.MacroRecorder object at 0x9e9588cc>
  196.     command-history: qutebrowser.misc.lineparser.LimitLineParser(binary=False, configdir='/home/dekks/.local/share/qutebrowser', fname='cmd-history', limit=('completion', 'cmd-history-max-items'))
  197.     args: Namespace(backend=None, basedir=None, color=True, command=[], debug=False, debug_exit=False, enable_webengine_inspector=False, force_color=False, harfbuzz='auto', json_args=None, json_logging=False, logfilter=None, loglevel='info', loglines=2000, no_err_windows=False, nowindow=False, override_restore=False, pdb_postmortem=False, qt_arg=None, qt_flag=None, relaxed_config=False, session=None, target=None, temp_basedir=False, temp_basedir_restarted=None, temp_settings=[], url=[], version=False)
  198.     last-focused-main-window: <qutebrowser.mainwindow.mainwindow.MainWindow>
  199.     key-config: qutebrowser.config.parsers.keyconf.KeyConfigParser(configfile='/home/dekks/.config/qutebrowser/keys.conf')
  200.     js-bridge: <qutebrowser.browser.webkit.network.webkitqutescheme.JSBridge object at 0x9e94b9bc>
  201.     web-history: <qutebrowser.browser.history.WebHistory length=2195>
  202.     save-manager: <qutebrowser.misc.savemanager.SaveManager saveables=OrderedDict([('version', <qutebrowser.misc.savemanager.Saveable config_opt=None dirty=False filename=None name='version' save_handler=<function _save_version at 0xa4a23a04> save_on_exit=True>), ('config', <qutebrowser.misc.savemanager.Saveable config_opt=('general', 'auto-save-config') dirty=False filename='/home/dekks/.config/qutebrowser/qutebrowser.conf' name='config' save_handler=<bound method ConfigManager.save of <qutebrowser.config.config.ConfigManager fname='qutebrowser.conf'>> save_on_exit=False>), ('key-config', <qutebrowser.misc.savemanager.Saveable config_opt=('general', 'auto-save-config') dirty=False filename='/home/dekks/.config/qutebrowser/keys.conf' name='key-config' save_handler=<bound method KeyConfigParser.save of qutebrowser.config.parsers.keyconf.KeyConfigParser(configfile='/home/dekks/.config/qutebrowser/keys.conf')> save_on_exit=False>), ('state-config', <qutebrowser.misc.savemanager.Saveable config_opt=None dirty=False filename=None name='state-config' save_handler=<bound method ReadWriteConfigParser.save of qutebrowser.config.parsers.ini.ReadWriteConfigParser(configdir='/home/dekks/.local/share/qutebrowser', fname='state')> save_on_exit=True>), ('command-history', <qutebrowser.misc.savemanager.Saveable config_opt=None dirty=False filename=None name='command-history' save_handler=<bound method LimitLineParser.save of qutebrowser.misc.lineparser.LimitLineParser(binary=False, configdir='/home/dekks/.local/share/qutebrowser', fname='cmd-history', limit=('completion', 'cmd-history-max-items'))> save_on_exit=False>), ('history', <qutebrowser.misc.savemanager.Saveable config_opt=None dirty=True filename=None name='history' save_handler=<bound method WebHistory.save of <qutebrowser.browser.history.WebHistory length=2195>> save_on_exit=False>), ('quickmark-manager', <qutebrowser.misc.savemanager.Saveable config_opt=None dirty=False filename='/home/dekks/.config/qutebrowser/quickmarks' name='quickmark-manager' save_handler=<bound method UrlMarkManager.save of <qutebrowser.browser.urlmarks.QuickmarkManager object at 0x9e9efb6c>> save_on_exit=False>), ('bookmark-manager', <qutebrowser.misc.savemanager.Saveable config_opt=None dirty=False filename='/home/dekks/.config/qutebrowser/bookmarks/urls' name='bookmark-manager' save_handler=<bound method UrlMarkManager.save of <qutebrowser.browser.urlmarks.BookmarkManager object at 0x9e94b1dc>> save_on_exit=False>), ('cookies', <qutebrowser.misc.savemanager.Saveable config_opt=('content', 'cookies-store') dirty=True filename=None name='cookies' save_handler=<bound method CookieJar.save of <qutebrowser.browser.webkit.cookies.CookieJar count=276>> save_on_exit=False>)])>
  203.     ipc-server: <qutebrowser.misc.ipc.IPCServer object at 0xa4a282b4>
  204.     crash-handler: <qutebrowser.misc.crashsignal.CrashHandler object at 0xa4a23b6c>
  205.     host-blocker: <qutebrowser.browser.adblock.HostBlocker object at 0xa00f470c>
  206.     cookie-jar: <qutebrowser.browser.webkit.cookies.CookieJar count=276>
  207.     ram-cookie-jar: <qutebrowser.browser.webkit.cookies.RAMCookieJar count=0>
  208.     session-manager: <qutebrowser.misc.sessions.SessionManager object at 0xa4a28bb4>
  209.     proxy-factory: <qutebrowser.browser.network.proxy.ProxyFactory object at 0x9e94b4f4>
  210.     event-filter: <qutebrowser.app.EventFilter object at 0x9e905c44>
  211.     quitter: <qutebrowser.app.Quitter object at 0xb698c94c>
  212.     config: <qutebrowser.config.config.ConfigManager fname='qutebrowser.conf'>
  213.     state-config: qutebrowser.config.parsers.ini.ReadWriteConfigParser(configdir='/home/dekks/.local/share/qutebrowser', fname='state')
  214.  
  215. window-0 object registry - 13 objects:
  216.     statusbar: <qutebrowser.mainwindow.statusbar.bar.StatusBar>
  217.     message-bridge: <qutebrowser.utils.message.MessageBridge>
  218.     qtnetwork-download-manager: <qutebrowser.browser.qtnetworkdownloads.DownloadManager downloads=0>
  219.     keyparsers: {<KeyMode.insert: 6>: <qutebrowser.keyinput.keyparser.PassthroughKeyParser mode='insert' warn=True>, <KeyMode.prompt: 5>: <qutebrowser.keyinput.keyparser.PassthroughKeyParser mode='prompt' warn=False>, <KeyMode.hint: 2>: <qutebrowser.keyinput.modeparsers.HintKeyParser supports_chains=True supports_count=False>, <KeyMode.caret: 8>: <qutebrowser.keyinput.modeparsers.CaretKeyParser supports_chains=True supports_count=True>, <KeyMode.set_mark: 9>: <qutebrowser.keyinput.modeparsers.RegisterKeyParser supports_chains=False supports_count=False>, <KeyMode.jump_mark: 10>: <qutebrowser.keyinput.modeparsers.RegisterKeyParser supports_chains=False supports_count=False>, <KeyMode.record_macro: 11>: <qutebrowser.keyinput.modeparsers.RegisterKeyParser supports_chains=False supports_count=False>, <KeyMode.passthrough: 7>: <qutebrowser.keyinput.keyparser.PassthroughKeyParser mode='passthrough' warn=True>, <KeyMode.normal: 1>: <qutebrowser.keyinput.modeparsers.NormalKeyParser>, <KeyMode.run_macro: 12>: <qutebrowser.keyinput.modeparsers.RegisterKeyParser supports_chains=False supports_count=False>, <KeyMode.yesno: 4>: <qutebrowser.keyinput.modeparsers.PromptKeyParser>, <KeyMode.command: 3>: <qutebrowser.keyinput.keyparser.PassthroughKeyParser mode='command' warn=True>}
  220.     command-dispatcher: <qutebrowser.browser.commands.CommandDispatcher>
  221.     prompt-container: <qutebrowser.mainwindow.prompt.PromptContainer win_id=0>
  222.     mode-manager: <qutebrowser.keyinput.modeman.ModeManager mode=<KeyMode.normal: 1>>
  223.     tabbed-browser: <qutebrowser.mainwindow.tabbedbrowser.TabbedBrowser count=0>
  224.     completion: <qutebrowser.completion.completionwidget.CompletionView>
  225.     download-model: <qutebrowser.browser.downloads.DownloadModel object at 0x9e90b8e4>
  226.     status-command: <qutebrowser.mainwindow.statusbar.command.Command>
  227.     tab-registry: {0: <qutebrowser.browser.webkit.webkittab.WebKitTab tab_id=0 url='https://www.reddit.com/r/corgi/comments/73fdn8/we_lost_gizmo_to_cancer_today_you_brightened_our/?ut…'>, 1: <qutebrowser.browser.webkit.webkittab.WebKitTab tab_id=1 url='https://kb.iu.edu/d/abue'>}
  228.     main-window: <qutebrowser.mainwindow.mainwindow.MainWindow>
  229.  
  230.     tab-0 object registry - 2 objects:
  231.         hintmanager: <qutebrowser.browser.hints.HintManager object at 0x9d76d104>
  232.         tab: <qutebrowser.browser.webkit.webkittab.WebKitTab tab_id=0 url='https://www.reddit.com/r/corgi/comments/73fdn8/we_lost_gizmo_to_cancer_today_you_brightened_our/?ut…'>
  233.  
  234.     tab-1 object registry - 2 objects:
  235.         hintmanager: <qutebrowser.browser.hints.HintManager object at 0x98b4102c>
  236.         tab: <qutebrowser.browser.webkit.webkittab.WebKitTab tab_id=1 url='https://kb.iu.edu/d/abue'>
  237.  
  238. ==== Debug log ====
  239. 10:19:09 DEBUG    init       earlyinit:init_log:366 Log initialized.
  240. 10:19:09 DEBUG    init       earlyinit:fix_harfbuzz:204 Using system harfbuzz engine (auto)
  241. 10:19:19 DEBUG    init       app:__init__:762 Qt arguments: ['/usr/bin/qutebrowser'], based on Namespace(backend=None, basedir=None, color=True, command=[], debug=False, debug_exit=False, enable_webengine_inspector=False, force_color=False, harfbuzz='auto', json_args=None, json_logging=False, logfilter=None, loglevel='info', loglines=2000, no_err_windows=False, nowindow=False, override_restore=False, pdb_postmortem=False, qt_arg=None, qt_flag=None, relaxed_config=False, session=None, target=None, temp_basedir=False, temp_basedir_restarted=None, temp_settings=[], url=[], version=False)
  242. 10:19:22 DEBUG    init       app:__init__:765 Initializing application...
  243. 10:19:22 DEBUG    init       app:run:81 Initializing directories...
  244. 10:19:22 DEBUG    init       standarddir:init:203 Base directory: None
  245. 10:19:22 DEBUG    misc       standarddir:_writable_location:143 writable location for CacheLocation: /home/dekks/.cache/qutebrowser
  246. 10:19:22 DEBUG    misc       standarddir:_writable_location:143 writable location for AppLocalDataLocation: /home/dekks/.local/share/qutebrowser
  247. 10:19:22 DEBUG    misc       standarddir:_writable_location:143 writable location for CacheLocation: /home/dekks/.cache/qutebrowser
  248. 10:19:22 DEBUG    misc       standarddir:_writable_location:143 writable location for RuntimeLocation: /run/user/1000
  249. 10:19:22 DEBUG    ipc        ipc:_has_legacy_server:428 Trying to connect to qutebrowser-dekks
  250. 10:19:22 DEBUG    ipc        ipc:_has_legacy_server:435 Socket error: QLocalSocket::connectToServer: Invalid name (2)
  251. 10:19:22 DEBUG    ipc        ipc:send_to_running_instance:475 Connecting to /run/user/1000/qutebrowser/ipc-081e3bba01648095baa903056c66922f
  252. 10:19:22 DEBUG    ipc        ipc:send_to_running_instance:508 No existing instance present (error 2)
  253. 10:19:22 DEBUG    init       ipc:send_or_listen:538 Starting IPC server...
  254. 10:19:22 DEBUG    ipc        ipc:__init__:192 Not calling setSocketOptions
  255. 10:19:22 DEBUG    ipc        ipc:listen:203 Listening as /run/user/1000/qutebrowser/ipc-081e3bba01648095baa903056c66922f
  256. 10:19:22 DEBUG    init       app:init:133 Starting init...
  257. 10:19:22 DEBUG    init       app:_init_modules:382 Initializing prompts...
  258. 10:19:22 DEBUG    init       app:_init_modules:385 Initializing save manager...
  259. 10:19:22 DEBUG    init       app:_init_modules:390 Initializing network...
  260. 10:19:23 DEBUG    init       networkmanager:init:94 Default Qt ciphers: ECDHE-RSA-AES256-GCM-SHA384, ECDHE-ECDSA-AES256-GCM-SHA384, ECDHE-RSA-AES256-SHA384, ECDHE-ECDSA-AES256-SHA384, ECDHE-RSA-AES256-SHA, ECDHE-ECDSA-AES256-SHA, SRP-DSS-AES-256-CBC-SHA, SRP-RSA-AES-256-CBC-SHA, SRP-AES-256-CBC-SHA, DH-DSS-AES256-GCM-SHA384, DHE-DSS-AES256-GCM-SHA384, DH-RSA-AES256-GCM-SHA384, DHE-RSA-AES256-GCM-SHA384, DHE-RSA-AES256-SHA256, DHE-DSS-AES256-SHA256, DH-RSA-AES256-SHA256, DH-DSS-AES256-SHA256, DHE-RSA-AES256-SHA, DHE-DSS-AES256-SHA, DH-RSA-AES256-SHA, DH-DSS-AES256-SHA, DHE-RSA-CAMELLIA256-SHA, DHE-DSS-CAMELLIA256-SHA, DH-RSA-CAMELLIA256-SHA, DH-DSS-CAMELLIA256-SHA, ECDH-RSA-AES256-GCM-SHA384, ECDH-ECDSA-AES256-GCM-SHA384, ECDH-RSA-AES256-SHA384, ECDH-ECDSA-AES256-SHA384, ECDH-RSA-AES256-SHA, ECDH-ECDSA-AES256-SHA, AES256-GCM-SHA384, AES256-SHA256, AES256-SHA, CAMELLIA256-SHA, PSK-AES256-CBC-SHA, ECDHE-RSA-AES128-GCM-SHA256, ECDHE-ECDSA-AES128-GCM-SHA256, ECDHE-RSA-AES128-SHA256, ECDHE-ECDSA-AES128-SHA256, ECDHE-RSA-AES128-SHA, ECDHE-ECDSA-AES128-SHA, SRP-DSS-AES-128-CBC-SHA, SRP-RSA-AES-128-CBC-SHA, SRP-AES-128-CBC-SHA, DH-DSS-AES128-GCM-SHA256, DHE-DSS-AES128-GCM-SHA256, DH-RSA-AES128-GCM-SHA256, DHE-RSA-AES128-GCM-SHA256, DHE-RSA-AES128-SHA256, DHE-DSS-AES128-SHA256, DH-RSA-AES128-SHA256, DH-DSS-AES128-SHA256, DHE-RSA-AES128-SHA, DHE-DSS-AES128-SHA, DH-RSA-AES128-SHA, DH-DSS-AES128-SHA, DHE-RSA-SEED-SHA, DHE-DSS-SEED-SHA, DH-RSA-SEED-SHA, DH-DSS-SEED-SHA, DHE-RSA-CAMELLIA128-SHA, DHE-DSS-CAMELLIA128-SHA, DH-RSA-CAMELLIA128-SHA, DH-DSS-CAMELLIA128-SHA, ECDH-RSA-AES128-GCM-SHA256, ECDH-ECDSA-AES128-GCM-SHA256, ECDH-RSA-AES128-SHA256, ECDH-ECDSA-AES128-SHA256, ECDH-RSA-AES128-SHA, ECDH-ECDSA-AES128-SHA, AES128-GCM-SHA256, AES128-SHA256, AES128-SHA, SEED-SHA, CAMELLIA128-SHA, PSK-AES128-CBC-SHA
  261. 10:19:23 DEBUG    init       networkmanager:init:110 Disabling bad ciphers:
  262. 10:19:23 DEBUG    init       app:_init_modules:398 Initializing readline-bridge...
  263. 10:19:23 DEBUG    init       app:_init_modules:402 Initializing config...
  264. 10:19:23 DEBUG    misc       standarddir:_writable_location:143 writable location for ConfigLocation: /home/dekks/.config
  265. 10:19:23 DEBUG    init       ini:__init__:54 Reading config from /home/dekks/.config/qutebrowser/qutebrowser.conf
  266. 10:19:23 DEBUG    config     config:_transform_hint_color:289 Transforming hint value black
  267. 10:19:23 DEBUG    config     config:_transform_hint_color:289 Transforming hint value qlineargradient(x1:0, y1:0, x2:0, y2:1, stop:0 rgba(255, 247, 133, 0.8), stop:1 rgba(255, 197, 66, 0.8))
  268. 10:19:23 DEBUG    config     config:_transform_hint_color:289 Transforming hint value green
  269. 10:19:23 DEBUG    url        urlutils:get_path_if_valid:360 Checking if 'https://start.duckduckgo.com' is a path
  270. 10:19:23 DEBUG    url        urlutils:fuzzy_url:193 URL is a fuzzy address
  271. 10:19:23 DEBUG    url        urlutils:fuzzy_url:196 Converting fuzzy term 'https://start.duckduckgo.com' to URL -> https://start.duckduckgo.com
  272. 10:19:23 DEBUG    misc       standarddir:_writable_location:143 writable location for ConfigLocation: /home/dekks/.config
  273. 10:19:23 DEBUG    misc       standarddir:_writable_location:143 writable location for ConfigLocation: /home/dekks/.config
  274. 10:19:23 DEBUG    init       keyconf:__init__:99 Loaded bindings: OrderedDict([('!normal', OrderedDict([('<escape>', 'leave-mode'), ('<ctrl-[>', 'leave-mode')])), ('normal', OrderedDict([('<escape>', 'clear-keychain ;; search ;; fullscreen --leave'), ('<ctrl-[>', 'clear-keychain ;; search ;; fullscreen --leave'), ('o', 'set-cmd-text -s :open'), ('go', 'set-cmd-text :open {url:pretty}'), ('O', 'set-cmd-text -s :open -t'), ('gO', 'set-cmd-text :open -t -i {url:pretty}'), ('xo', 'set-cmd-text -s :open -b'), ('xO', 'set-cmd-text :open -b -i {url:pretty}'), ('wo', 'set-cmd-text -s :open -w'), ('wO', 'set-cmd-text :open -w {url:pretty}'), ('/', 'set-cmd-text /'), ('?', 'set-cmd-text ?'), (':', 'set-cmd-text :'), ('ga', 'open -t'), ('<ctrl-t>', 'open -t'), ('<ctrl-n>', 'open -w'), ('d', 'tab-close'), ('<ctrl-w>', 'tab-close'), ('D', 'tab-close -o'), ('co', 'tab-only'), ('T', 'tab-focus'), ('gm', 'tab-move'), ('gl', 'tab-move -'), ('gr', 'tab-move +'), ('J', 'tab-next'), ('<ctrl-pgdown>', 'tab-next'), ('K', 'tab-prev'), ('<ctrl-pgup>', 'tab-prev'), ('gC', 'tab-clone'), ('r', 'reload'), ('<f5>', 'reload'), ('R', 'reload -f'), ('<ctrl-f5>', 'reload -f'), ('H', 'back'), ('<back>', 'back'), ('th', 'back -t'), ('wh', 'back -w'), ('L', 'forward'), ('<forward>', 'forward'), ('tl', 'forward -t'), ('wl', 'forward -w'), ('<f11>', 'fullscreen'), ('f', 'hint'), ('F', 'hint all tab'), ('wf', 'hint all window'), (';b', 'hint all tab-bg'), (';f', 'hint all tab-fg'), (';h', 'hint all hover'), (';i', 'hint images'), (';I', 'hint images tab'), (';o', 'hint links fill :open {hint-url}'), (';O', 'hint links fill :open -t -i {hint-url}'), (';y', 'hint links yank'), (';Y', 'hint links yank-primary'), (';r', 'hint --rapid links tab-bg'), (';R', 'hint --rapid links window'), (';d', 'hint links download'), (';t', 'hint inputs'), ('h', 'scroll left'), ('j', 'scroll down'), ('k', 'scroll up'), ('l', 'scroll right'), ('u', 'undo'), ('<ctrl-shift-t>', 'undo'), ('gg', 'scroll-perc 0'), ('G', 'scroll-perc'), ('n', 'search-next'), ('N', 'search-prev'), ('i', 'enter-mode insert'), ('v', 'enter-mode caret'), ('`', 'enter-mode set_mark'), ("'", 'enter-mode jump_mark'), ('yy', 'yank'), ('yY', 'yank -s'), ('yt', 'yank title'), ('yT', 'yank title -s'), ('yd', 'yank domain'), ('yD', 'yank domain -s'), ('yp', 'yank pretty-url'), ('yP', 'yank pretty-url -s'), ('pp', 'open -- {clipboard}'), ('pP', 'open -- {primary}'), ('Pp', 'open -t -- {clipboard}'), ('PP', 'open -t -- {primary}'), ('wp', 'open -w -- {clipboard}'), ('wP', 'open -w -- {primary}'), ('m', 'quickmark-save'), ('b', 'set-cmd-text -s :quickmark-load'), ('B', 'set-cmd-text -s :quickmark-load -t'), ('wb', 'set-cmd-text -s :quickmark-load -w'), ('M', 'bookmark-add'), ('gb', 'set-cmd-text -s :bookmark-load'), ('gB', 'set-cmd-text -s :bookmark-load -t'), ('wB', 'set-cmd-text -s :bookmark-load -w'), ('sf', 'save'), ('ss', 'set-cmd-text -s :set'), ('sl', 'set-cmd-text -s :set -t'), ('sk', 'set-cmd-text -s :bind'), ('-', 'zoom-out'), ('+', 'zoom-in'), ('=', 'zoom'), ('[[', 'navigate prev'), (']]', 'navigate next'), ('{{', 'navigate prev -t'), ('}}', 'navigate next -t'), ('gu', 'navigate up'), ('gU', 'navigate up -t'), ('<ctrl-a>', 'navigate increment'), ('<ctrl-x>', 'navigate decrement'), ('wi', 'inspector'), ('gd', 'download'), ('ad', 'download-cancel'), ('cd', 'download-clear'), ('gf', 'view-source'), ('gt', 'set-cmd-text -s :buffer'), ('<ctrl-tab>', 'tab-focus last'), ('<ctrl-v>', 'enter-mode passthrough'), ('<ctrl-q>', 'quit'), ('<ctrl-f>', 'scroll-page 0 1'), ('<ctrl-b>', 'scroll-page 0 -1'), ('<ctrl-d>', 'scroll-page 0 0.5'), ('<ctrl-u>', 'scroll-page 0 -0.5'), ('<alt-1>', 'tab-focus 1'), ('<alt-2>', 'tab-focus 2'), ('<alt-3>', 'tab-focus 3'), ('<alt-4>', 'tab-focus 4'), ('<alt-5>', 'tab-focus 5'), ('<alt-6>', 'tab-focus 6'), ('<alt-7>', 'tab-focus 7'), ('<alt-8>', 'tab-focus 8'), ('<alt-9>', 'tab-focus 9'), ('<ctrl-h>', 'home'), ('<ctrl-s>', 'stop'), ('<ctrl-alt-p>', 'print'), ('Ss', 'open qute:settings'), ('<return>', 'follow-selected'), ('<ctrl-m>', 'follow-selected'), ('<ctrl-j>', 'follow-selected'), ('<shift-return>', 'follow-selected'), ('<enter>', 'follow-selected'), ('<shift-enter>', 'follow-selected'), ('<ctrl-return>', 'follow-selected -t'), ('<ctrl-enter>', 'follow-selected -t'), ('.', 'repeat-command'), ('q', 'record-macro'), ('@', 'run-macro')])), ('insert', OrderedDict([('<ctrl-e>', 'open-editor'), ('<shift-ins>', 'insert-text {primary}')])), ('hint', OrderedDict([('<return>', 'follow-hint'), ('<ctrl-m>', 'follow-hint'), ('<ctrl-j>', 'follow-hint'), ('<shift-return>', 'follow-hint'), ('<enter>', 'follow-hint'), ('<shift-enter>', 'follow-hint'), ('<ctrl-r>', 'hint --rapid links tab-bg'), ('<ctrl-f>', 'hint links'), ('<ctrl-b>', 'hint all tab-bg')])), ('command', OrderedDict([('<ctrl-p>', 'command-history-prev'), ('<ctrl-n>', 'command-history-next'), ('<shift-tab>', 'completion-item-focus prev'), ('<up>', 'completion-item-focus prev'), ('<tab>', 'completion-item-focus next'), ('<down>', 'completion-item-focus next'), ('<ctrl-tab>', 'completion-item-focus next-category'), ('<ctrl-shift-tab>', 'completion-item-focus prev-category'), ('<ctrl-d>', 'completion-item-del'), ('<return>', 'command-accept'), ('<ctrl-m>', 'command-accept'), ('<ctrl-j>', 'command-accept'), ('<shift-return>', 'command-accept'), ('<enter>', 'command-accept'), ('<shift-enter>', 'command-accept')])), ('prompt', OrderedDict([('<return>', 'prompt-accept'), ('<ctrl-m>', 'prompt-accept'), ('<ctrl-j>', 'prompt-accept'), ('<shift-return>', 'prompt-accept'), ('<enter>', 'prompt-accept'), ('<shift-enter>', 'prompt-accept'), ('y', 'prompt-accept yes'), ('n', 'prompt-accept no'), ('<ctrl-x>', 'prompt-open-download'), ('<shift-tab>', 'prompt-item-focus prev'), ('<up>', 'prompt-item-focus prev'), ('<tab>', 'prompt-item-focus next'), ('<down>', 'prompt-item-focus next')])), ('command,prompt', OrderedDict([('<ctrl-b>', 'rl-backward-char'), ('<ctrl-f>', 'rl-forward-char'), ('<alt-b>', 'rl-backward-word'), ('<alt-f>', 'rl-forward-word'), ('<ctrl-a>', 'rl-beginning-of-line'), ('<ctrl-e>', 'rl-end-of-line'), ('<ctrl-u>', 'rl-unix-line-discard'), ('<ctrl-k>', 'rl-kill-line'), ('<alt-d>', 'rl-kill-word'), ('<ctrl-w>', 'rl-unix-word-rubout'), ('<alt-backspace>', 'rl-backward-kill-word'), ('<ctrl-y>', 'rl-yank'), ('<ctrl-?>', 'rl-delete-char'), ('<ctrl-h>', 'rl-backward-delete-char')])), ('caret', OrderedDict([('v', 'toggle-selection'), ('<space>', 'toggle-selection'), ('<ctrl-space>', 'drop-selection'), ('c', 'enter-mode normal'), ('j', 'move-to-next-line'), ('k', 'move-to-prev-line'), ('l', 'move-to-next-char'), ('h', 'move-to-prev-char'), ('e', 'move-to-end-of-word'), ('w', 'move-to-next-word'), ('b', 'move-to-prev-word'), (']', 'move-to-start-of-next-block'), ('[', 'move-to-start-of-prev-block'), ('}', 'move-to-end-of-next-block'), ('{', 'move-to-end-of-prev-block'), ('0', 'move-to-start-of-line'), ('$', 'move-to-end-of-line'), ('gg', 'move-to-start-of-document'), ('G', 'move-to-end-of-document'), ('Y', 'yank selection -s'), ('y', 'yank selection'), ('<return>', 'yank selection'), ('<ctrl-m>', 'yank selection'), ('<ctrl-j>', 'yank selection'), ('<shift-return>', 'yank selection'), ('<enter>', 'yank selection'), ('<shift-enter>', 'yank selection'), ('H', 'scroll left'), ('J', 'scroll down'), ('K', 'scroll up'), ('L', 'scroll right')]))])
  275. 10:19:23 DEBUG    misc       standarddir:_writable_location:143 writable location for ConfigLocation: /home/dekks/.config
  276. 10:19:23 DEBUG    save       savemanager:mark_dirty:72 Marking key-config as dirty.
  277. 10:19:23 DEBUG    misc       standarddir:_writable_location:143 writable location for AppLocalDataLocation: /home/dekks/.local/share/qutebrowser
  278. 10:19:23 DEBUG    init       ini:__init__:54 Reading config from /home/dekks/.local/share/qutebrowser/state
  279. 10:19:23 DEBUG    misc       standarddir:_writable_location:143 writable location for AppLocalDataLocation: /home/dekks/.local/share/qutebrowser
  280. 10:19:23 DEBUG    init       lineparser:__init__:223 Reading /home/dekks/.local/share/qutebrowser/cmd-history
  281. 10:19:23 DEBUG    misc       standarddir:_writable_location:143 writable location for ConfigLocation: /home/dekks/.config
  282. 10:19:23 DEBUG    init       app:_init_modules:406 Initializing web history...
  283. 10:19:23 DEBUG    misc       standarddir:_writable_location:143 writable location for AppLocalDataLocation: /home/dekks/.local/share/qutebrowser
  284. 10:19:23 DEBUG    init       app:_init_modules:409 Initializing crashlog...
  285. 10:19:23 DEBUG    misc       standarddir:_writable_location:143 writable location for AppLocalDataLocation: /home/dekks/.local/share/qutebrowser
  286. 10:19:23 DEBUG    misc       standarddir:_writable_location:143 writable location for AppLocalDataLocation: /home/dekks/.local/share/qutebrowser
  287. 10:19:23 DEBUG    init       app:_init_modules:413 Initializing sessions...
  288. 10:19:23 DEBUG    misc       standarddir:_writable_location:143 writable location for AppLocalDataLocation: /home/dekks/.local/share/qutebrowser
  289. 10:19:23 DEBUG    init       app:_init_modules:416 Initializing websettings...
  290. 10:19:23 DEBUG    misc       standarddir:_writable_location:143 writable location for CacheLocation: /home/dekks/.cache/qutebrowser
  291. 10:19:23 DEBUG    misc       standarddir:_writable_location:143 writable location for AppLocalDataLocation: /home/dekks/.local/share/qutebrowser
  292. 10:19:23 DEBUG    misc       standarddir:_writable_location:143 writable location for CacheLocation: /home/dekks/.cache/qutebrowser
  293. 10:19:23 DEBUG    init       app:_init_modules:419 Initializing adblock...
  294. 10:19:23 DEBUG    misc       standarddir:_writable_location:143 writable location for AppLocalDataLocation: /home/dekks/.local/share/qutebrowser
  295. 10:19:23 DEBUG    misc       standarddir:_writable_location:143 writable location for ConfigLocation: /home/dekks/.config
  296. 10:19:27 DEBUG    init       app:_init_modules:424 Initializing quickmarks...
  297. 10:19:27 DEBUG    misc       standarddir:_writable_location:143 writable location for ConfigLocation: /home/dekks/.config
  298. 10:19:27 DEBUG    init       lineparser:__init__:223 Reading /home/dekks/.config/qutebrowser/quickmarks
  299. 10:19:27 DEBUG    misc       standarddir:_writable_location:143 writable location for ConfigLocation: /home/dekks/.config
  300. 10:19:27 DEBUG    init       app:_init_modules:428 Initializing bookmarks...
  301. 10:19:27 DEBUG    misc       standarddir:_writable_location:143 writable location for ConfigLocation: /home/dekks/.config
  302. 10:19:27 DEBUG    misc       standarddir:_writable_location:143 writable location for ConfigLocation: /home/dekks/.config
  303. 10:19:27 DEBUG    init       lineparser:__init__:223 Reading /home/dekks/.config/qutebrowser/bookmarks/urls
  304. 10:19:27 DEBUG    misc       standarddir:_writable_location:143 writable location for ConfigLocation: /home/dekks/.config
  305. 10:19:27 DEBUG    init       app:_init_modules:432 Initializing cookies...
  306. 10:19:27 DEBUG    misc       standarddir:_writable_location:143 writable location for AppLocalDataLocation: /home/dekks/.local/share/qutebrowser
  307. 10:19:27 DEBUG    init       lineparser:__init__:223 Reading /home/dekks/.local/share/qutebrowser/cookies
  308. 10:19:27 DEBUG    init       app:_init_modules:438 Initializing cache...
  309. 10:19:27 DEBUG    misc       standarddir:_writable_location:143 writable location for CacheLocation: /home/dekks/.cache/qutebrowser
  310. 10:19:27 DEBUG    init       app:_init_modules:442 Initializing completions...
  311. 10:19:27 DEBUG    init       app:_init_modules:445 Misc initialization...
  312. 10:19:28 DEBUG    init       webkittab:init:47 Initializing proxy...
  313. 10:19:28 DEBUG    init       webkittab:init:50 Initializing js-bridge...
  314. 10:19:28 DEBUG    init       app:init:145 Initializing eventfilter...
  315. 10:19:28 DEBUG    init       app:init:150 Connecting signals...
  316. 10:19:28 DEBUG    sessions   sessions:load:380 Loading session _autosave from /home/dekks/.local/share/qutebrowser/sessions/_autosave.yml...
  317. 10:19:28 DEBUG    init       mainwindow:_init_downloadmanager:272 Initializing downloads...
  318. 10:19:28 DEBUG    init       networkmanager:__init__:139 Initializing NetworkManager
  319. 10:19:29 DEBUG    init       networkmanager:__init__:144 NetworkManager init done
  320. 10:19:29 DEBUG    statusbar  bar:_hide_cmd_widget:272 Hiding cmd widget
  321. 10:19:29 DEBUG    init       mainwindow:__init__:179 Initializing modes...
  322. 10:19:29 DEBUG    init       mainwindow:_load_geometry:378 Loading mainwindow from b'\x01\xd9\xd0\xcb\x00\x02\x00\x00\x00\x00\x00\x00\x00\x00\x00\x14\x00\x00\x03\xff\x00\x00\x02\xff\x00\x00\x00\x02\x00\x00\x00\x16\x00\x00\x03\xfd\x00\x00\x02\xfd\x00\x00\x00\x00\x00\x00\x00\x00\x04\x00'
  323. 10:19:29 DEBUG    init       mainwindow:__init__:205 Initial main window geometry: PyQt5.QtCore.QRect(0, 20, 1020, 744)
  324. 10:19:29 DEBUG    webview    tabbedbrowser:tabopen:393 Creating new tab with URL None, background None, explicit False, idx None
  325. 10:19:29 DEBUG    init       networkmanager:__init__:139 Initializing NetworkManager
  326. 10:19:29 DEBUG    init       networkmanager:__init__:144 NetworkManager init done
  327. 10:19:29 DEBUG    webview    tabbedbrowser:_get_new_tab_idx:455 new-tab-position next -> opening new tab at -1, next left: 0 / right: 0
  328. 10:19:29 DEBUG    modes      tabbedbrowser:on_current_changed:590 Current tab changed, focusing <qutebrowser.browser.webkit.webkittab.WebKitTab tab_id=0 url=''>
  329. 10:19:29 DEBUG    modes      modeman:leave:294 Ignoring leave request for KeyMode.hint (reason tab changed) as we're in mode KeyMode.normal
  330. 10:19:29 DEBUG    modes      modeman:leave:294 Ignoring leave request for KeyMode.insert (reason tab changed) as we're in mode KeyMode.normal
  331. 10:19:29 DEBUG    modes      modeman:leave:294 Ignoring leave request for KeyMode.caret (reason tab changed) as we're in mode KeyMode.normal
  332. 10:19:29 DEBUG    modes      modeman:leave:294 Ignoring leave request for KeyMode.passthrough (reason tab changed) as we're in mode KeyMode.normal
  333. 10:19:30 DEBUG    webview    tabbedbrowser:on_title_changed:523 Changing title for idx 0 to 'reddit: the front page of the internet'
  334. 10:19:30 DEBUG    webview    webpage:acceptNavigationRequest:478 navigation request: url https://www.reddit.com/, type NavigationTypeBackOrForward, target ClickTarget.normal override None
  335. 10:19:30 DEBUG    webview    browsertab:_set_load_status:627 load status for <qutebrowser.browser.webkit.webkittab.WebKitTab tab_id=0 url=''>: LoadStatus.loading
  336. 10:19:30 DEBUG    signals    signalfilter:_filter_signals:86 emitting: cur_load_status_changed('loading') (tab 0)
  337. 10:19:30 DEBUG    signals    signalfilter:_filter_signals:86 emitting: cur_load_started() (tab 0)
  338. 10:19:30 DEBUG    modes      modeman:leave:294 Ignoring leave request for KeyMode.insert (reason load started) as we're in mode KeyMode.normal
  339. 10:19:30 DEBUG    modes      modeman:leave:294 Ignoring leave request for KeyMode.hint (reason load started) as we're in mode KeyMode.normal
  340. 10:19:30 DEBUG    init       app:_process_args:206 Init finished after 20.773864s
  341. 10:19:30 DEBUG    init       app:init:163 Init done!
  342. 10:19:30 DEBUG    save       savemanager:save:97 Save of key-config requested - dirty True, save_on_exit False, is_exit False, force False -> True
  343. 10:19:30 DEBUG    destroy    keyconf:save:144 Saving key config to /home/dekks/.config/qutebrowser/keys.conf
  344. 10:19:30 DEBUG    misc       mainwindow:_update_overlay_geometry:267 new geometry for <qutebrowser.mainwindow.messageview.MessageView object at 0x9e93b14c>: PyQt5.QtCore.QRect(0, 730, 1021, 1)
  345. 10:19:30 DEBUG    init       app:_init_late_modules:457 Reading web history...
  346. 10:19:30 DEBUG    misc       app:on_focus_object_changed:779 Focus object changed: <qutebrowser.browser.webkit.webview.WebView tab_id=0 url=''>
  347. 10:19:31 DEBUG    save       savemanager:mark_dirty:72 Marking cookies as dirty.
  348. 10:19:31 DEBUG    webview    tabbedbrowser:on_title_changed:523 Changing title for idx 0 to 'https://www.reddit.com/'
  349. 10:19:31 DEBUG    signals    signalfilter:_filter_signals:86 emitting: cur_url_changed(PyQt5.QtCore.QUrl('https://www.reddit.com/')) (tab 0)
  350. 10:19:31 DEBUG    webview    tabbedbrowser:on_title_changed:515 Ignoring title change to ''.
  351. 10:19:31 DEBUG    webview    tabbedbrowser:on_title_changed:523 Changing title for idx 0 to 'reddit: the front page of the internet'
  352. 10:19:33 INFO     webview    networkmanager:createRequest:422 Request to ssl.google-analytics.com blocked by host blocker.
  353. 10:19:33 INFO     webview    networkmanager:createRequest:422 Request to www.google-analytics.com blocked by host blocker.
  354. 10:19:33 DEBUG    webview    webpage:acceptNavigationRequest:478 navigation request: url https://www.redditmedia.com/gtm/jail?cb=8CqR7FcToPI, type NavigationTypeOther, target ClickTarget.normal override None
  355. 10:19:35 INFO     webview    networkmanager:createRequest:422 Request to www.googletagservices.com blocked by host blocker.
  356. 10:19:35 INFO     webview    networkmanager:createRequest:422 Request to c.amazon-adsystem.com blocked by host blocker.
  357. 10:19:35 INFO     webview    networkmanager:createRequest:422 Request to pixel.redditmedia.com blocked by host blocker.
  358. 10:19:35 DEBUG    save       savemanager:mark_dirty:72 Marking cookies as dirty.
  359. 10:19:35 DEBUG    save       savemanager:mark_dirty:72 Marking cookies as dirty.
  360. 10:19:36 DEBUG    webview    webpage:acceptNavigationRequest:478 navigation request: url https://www.redditmedia.com/gtm?id=GTM-NDJTNB&cb=8CqR7FcToPI, type NavigationTypeOther, target ClickTarget.normal override None
  361. 10:19:36 INFO     webview    networkmanager:createRequest:422 Request to www.googletagmanager.com blocked by host blocker.
  362. 10:19:36 DEBUG    save       savemanager:mark_dirty:72 Marking cookies as dirty.
  363. 10:19:36 DEBUG    webview    webpage:acceptNavigationRequest:478 navigation request: url https://www.redditmedia.com/moat/proxy#, type NavigationTypeOther, target ClickTarget.normal override None
  364. 10:19:36 INFO     webview    networkmanager:createRequest:422 Request to pixel.redditmedia.com blocked by host blocker.
  365. 10:19:36 INFO     webview    networkmanager:createRequest:422 Request to pixel.redditmedia.com blocked by host blocker.
  366. 10:19:36 DEBUG    save       savemanager:mark_dirty:72 Marking cookies as dirty.
  367. 10:19:36 INFO     webview    networkmanager:createRequest:422 Request to z.moatads.com blocked by host blocker.
  368. 10:19:36 DEBUG    init       debug:__exit__:260 Reading history took 6.854646 seconds.
  369. 10:19:37 DEBUG    modes      modeman:_eventFilter_keypress:167 got keypress in mode KeyMode.normal - delegating to <qutebrowser.keyinput.modeparsers.NormalKeyParser>
  370. 10:19:37 DEBUG    keyboard   basekeyparser:_debug_log:112 Ignoring only-modifier keyeevent.
  371. 10:19:37 DEBUG    keyboard   basekeyparser:_debug_log:112 Got key: 0x1000023 / text: ''
  372. 10:19:37 DEBUG    keyboard   basekeyparser:_debug_log:112 Ignoring, no text char
  373. 10:19:37 DEBUG    modes      modeman:_eventFilter_keypress:192 handled: False, forward-unbound-keys: auto, passthrough: False, is_non_alnum: True --> filter: False (focused: <qutebrowser.browser.webkit.webview.WebView tab_id=0 url='https://www.reddit.com/'>)
  374. 10:19:38 DEBUG    misc       app:on_focus_object_changed:779 Focus object changed: None
  375. 10:19:38 DEBUG    destroy    lineparser:_after_save:82 Saved to /home/dekks/.local/share/qutebrowser/cookies
  376. 10:19:39 DEBUG    sessions   sessions:save:280 Saving session _autosave to /home/dekks/.local/share/qutebrowser/sessions/_autosave.yml...
  377. 10:19:39 DEBUG    webview    browsertab:_set_load_status:627 load status for <qutebrowser.browser.webkit.webkittab.WebKitTab tab_id=0 url='https://www.reddit.com/'>: LoadStatus.success_https
  378. 10:19:39 DEBUG    signals    signalfilter:_filter_signals:86 emitting: cur_load_status_changed('success_https') (tab 0)
  379. 10:19:39 DEBUG    signals    signalfilter:_filter_signals:86 emitting: cur_load_finished(True) (tab 0)
  380. 10:24:22 DEBUG    misc       app:on_focus_object_changed:779 Focus object changed: <qutebrowser.browser.webkit.webview.WebView tab_id=0 url='https://www.reddit.com/'>
  381. 10:24:22 DEBUG    modes      modeman:_eventFilter_keyrelease:212 filter: False
  382. 10:24:22 DEBUG    save       savemanager:mark_dirty:72 Marking cookies as dirty.
  383. 10:24:22 DEBUG    webview    webpage:acceptNavigationRequest:478 navigation request: url https://www.redditmedia.com/moat/proxy#, type NavigationTypeOther, target ClickTarget.normal override None
  384. 10:24:22 INFO     webview    networkmanager:createRequest:422 Request to pixel.redditmedia.com blocked by host blocker.
  385. 10:24:22 INFO     webview    networkmanager:createRequest:422 Request to pixel.redditmedia.com blocked by host blocker.
  386. 10:24:23 INFO     webview    networkmanager:createRequest:422 Request to z.moatads.com blocked by host blocker.
  387. 10:24:23 DEBUG    destroy    lineparser:_after_save:82 Saved to /home/dekks/.local/share/qutebrowser/cookies
  388. 10:24:24 DEBUG    modes      modeman:_eventFilter_keypress:167 got keypress in mode KeyMode.normal - delegating to <qutebrowser.keyinput.modeparsers.NormalKeyParser>
  389. 10:24:24 DEBUG    keyboard   basekeyparser:_debug_log:112 Ignoring only-modifier keyeevent.
  390. 10:24:24 DEBUG    keyboard   basekeyparser:_debug_log:112 Got key: 0x1000020 / text: ''
  391. 10:24:24 DEBUG    keyboard   basekeyparser:_debug_log:112 Ignoring, no text char
  392. 10:24:24 DEBUG    modes      modeman:_eventFilter_keypress:192 handled: False, forward-unbound-keys: auto, passthrough: False, is_non_alnum: True --> filter: False (focused: <qutebrowser.browser.webkit.webview.WebView tab_id=0 url='https://www.reddit.com/'>)
  393. 10:24:25 DEBUG    modes      modeman:_eventFilter_keypress:167 got keypress in mode KeyMode.normal - delegating to <qutebrowser.keyinput.modeparsers.NormalKeyParser>
  394. 10:24:25 DEBUG    keyboard   basekeyparser:_debug_log:112 No special binding found for shift+b.
  395. 10:24:25 DEBUG    keyboard   basekeyparser:_debug_log:112 Got key: 0x42 / text: 'B'
  396. 10:24:25 DEBUG    keyboard   basekeyparser:_debug_log:112 Definitive match for 'B'.
  397. 10:24:25 DEBUG    keyboard   basekeyparser:_debug_log:112 discarding keystring 'B'.
  398. 10:24:25 DEBUG    commands   command:run:509 command called: set-cmd-text ['-s', ':quickmark-load -t']
  399. 10:24:25 DEBUG    commands   command:run:524 Calling qutebrowser.mainwindow.statusbar.command.Command.set_cmd_text_command(<qutebrowser.mainwindow.statusbar.command.Command>, ':quickmark-load -t', True, False)
  400. 10:24:25 DEBUG    completion completer:schedule_completion_update:222 Scheduling completion update.
  401. 10:24:25 DEBUG    completion completer:schedule_completion_update:219 Ignoring update because there were no changes.
  402. 10:24:25 DEBUG    modes      command:set_cmd_text:87 Setting command text, focusing <qutebrowser.mainwindow.statusbar.command.Command>
  403. 10:24:25 DEBUG    modes      modeman:enter:238 Entering mode KeyMode.command (reason: cmd focus)
  404. 10:24:25 DEBUG    statusbar  text:set_text:55 Setting normal text to '-- COMMAND MODE --'.
  405. 10:24:25 DEBUG    statusbar  bar:set_mode_active:239 Setting command_active to True
  406. 10:24:25 DEBUG    webview    webview:on_mode_entered:164 Ignoring focus because mode KeyMode.command was entered.
  407. 10:24:25 DEBUG    misc       app:on_focus_object_changed:779 Focus object changed: <qutebrowser.mainwindow.statusbar.command.Command>
  408. 10:24:25 DEBUG    misc       app:on_focus_object_changed:779 Focus object changed: <qutebrowser.browser.webkit.webview.WebView tab_id=0 url='https://www.reddit.com/'>
  409. 10:24:25 DEBUG    misc       app:on_focus_object_changed:779 Focus object changed: <qutebrowser.mainwindow.statusbar.command.Command>
  410. 10:24:25 DEBUG    modes      modeman:_eventFilter_keypress:192 handled: True, forward-unbound-keys: auto, passthrough: False, is_non_alnum: False --> filter: True (focused: <qutebrowser.mainwindow.statusbar.command.Command>)
  411. 10:24:25 DEBUG    modes      modeman:_eventFilter_keyrelease:212 filter: True
  412. 10:24:25 DEBUG    modes      modeman:_eventFilter_keyrelease:212 filter: False
  413. 10:24:25 DEBUG    completion completer:_partition:162 partitioning ['quickmark-load', ' -t', ' '] around position 18
  414. 10:24:25 DEBUG    completion completer:_partition:174 partitioned: ['quickmark-load', '-t'] '' []
  415. 10:24:25 DEBUG    completion completer:_update_completion:249 Updating completion: ['quickmark-load', '-t']  []
  416. 10:24:25 DEBUG    completion completer:_get_new_completion:107 Before removing flags: ['quickmark-load', '-t']
  417. 10:24:25 DEBUG    completion completer:_get_new_completion:109 After removing flags: ['quickmark-load']
  418. 10:24:25 DEBUG    completion instances:init_quickmark_completions:86 Initializing quickmark completion.
  419. 10:24:25 DEBUG    completion completer:_update_completion:256 Setting completion model to QuickmarkCompletionModel with pattern ''
  420. 10:24:26 DEBUG    misc       mainwindow:_update_overlay_geometry:267 new geometry for <qutebrowser.completion.completionwidget.CompletionView>: PyQt5.QtCore.QRect(0, 358, 1021, 373)
  421. 10:24:26 DEBUG    completion debug:__exit__:260 Setting filter pattern took 0.000428 seconds.
  422. 10:24:28 DEBUG    modes      modeman:_eventFilter_keypress:167 got keypress in mode KeyMode.command - delegating to <qutebrowser.keyinput.keyparser.PassthroughKeyParser mode='command' warn=True>
  423. 10:24:28 DEBUG    commands   command:run:509 command called: completion-item-focus ['next']
  424. 10:24:28 DEBUG    commands   command:run:524 Calling qutebrowser.completion.completionwidget.CompletionView.completion_item_focus(<qutebrowser.completion.completionwidget.CompletionView>, 'next')
  425. 10:24:28 DEBUG    completion completer:_partition:162 partitioning ['quickmark-load', ' -t', ' '] around position 18
  426. 10:24:28 DEBUG    completion completer:_partition:174 partitioned: ['quickmark-load', '-t'] '' []
  427. 10:24:28 DEBUG    completion completer:on_selection_changed:189 Changing  to 'DDG'
  428. 10:24:28 DEBUG    completion completer:on_selection_changed:206 Will ignore next completion update.
  429. 10:24:28 DEBUG    completion completer:_change_completed_part:278 setting text = ':quickmark-load -t DDG', pos = 22
  430. 10:24:28 DEBUG    completion completer:schedule_completion_update:222 Scheduling completion update.
  431. 10:24:28 DEBUG    completion completer:schedule_completion_update:219 Ignoring update because there were no changes.
  432. 10:24:28 DEBUG    modes      modeman:_eventFilter_keypress:192 handled: True, forward-unbound-keys: auto, passthrough: True, is_non_alnum: True --> filter: True (focused: <qutebrowser.mainwindow.statusbar.command.Command>)
  433. 10:24:28 DEBUG    completion completer:_update_completion:231 Ignoring completion update because ignore_change is True.
  434. 10:24:28 DEBUG    modes      modeman:_eventFilter_keyrelease:212 filter: True
  435. 10:24:28 DEBUG    modes      modeman:_eventFilter_keypress:167 got keypress in mode KeyMode.command - delegating to <qutebrowser.keyinput.keyparser.PassthroughKeyParser mode='command' warn=True>
  436. 10:24:28 DEBUG    commands   command:run:509 command called: command-accept
  437. 10:24:28 DEBUG    commands   command:run:524 Calling qutebrowser.mainwindow.statusbar.command.Command.command_accept(<qutebrowser.mainwindow.statusbar.command.Command>)
  438. 10:24:28 DEBUG    save       savemanager:mark_dirty:72 Marking command-history as dirty.
  439. 10:24:28 DEBUG    modes      modeman:leave:300 Leaving mode KeyMode.command (reason: cmd accept)
  440. 10:24:28 DEBUG    statusbar  text:set_text:55 Setting normal text to ''.
  441. 10:24:28 DEBUG    statusbar  bar:set_mode_active:239 Setting command_active to False
  442. 10:24:28 DEBUG    completion completer:schedule_completion_update:222 Scheduling completion update.
  443. 10:24:28 DEBUG    completion completer:schedule_completion_update:219 Ignoring update because there were no changes.
  444. 10:24:28 DEBUG    statusbar  bar:_hide_cmd_widget:272 Hiding cmd widget
  445. 10:24:28 DEBUG    misc       app:on_focus_object_changed:779 Focus object changed: <qutebrowser.mainwindow.mainwindow.MainWindow>
  446. 10:24:28 DEBUG    misc       app:on_focus_object_changed:779 Focus object changed: <qutebrowser.mainwindow.statusbar.text.Text text=''>
  447. 10:24:28 DEBUG    modes      tabbedbrowser:on_mode_left:573 Left status-input mode, focusing <qutebrowser.browser.webkit.webkittab.WebKitTab tab_id=0 url='https://www.reddit.com/'>
  448. 10:24:28 DEBUG    misc       app:on_focus_object_changed:779 Focus object changed: <qutebrowser.browser.webkit.webview.WebView tab_id=0 url='https://www.reddit.com/'>
  449. 10:24:28 DEBUG    webview    webview:on_mode_left:177 Restoring focus policy because mode KeyMode.command was left.
  450. 10:24:28 DEBUG    commands   command:run:509 command called: quickmark-load ['-t', 'DDG']
  451. 10:24:28 DEBUG    commands   command:run:524 Calling qutebrowser.browser.commands.CommandDispatcher.quickmark_load(<qutebrowser.browser.commands.CommandDispatcher>, 'DDG', True, False, False)
  452. 10:24:28 DEBUG    url        urlutils:get_path_if_valid:360 Checking if 'https://start.duckduckgo.com/' is a path
  453. 10:24:28 DEBUG    url        urlutils:fuzzy_url:193 URL is a fuzzy address
  454. 10:24:28 DEBUG    url        urlutils:fuzzy_url:196 Converting fuzzy term 'https://start.duckduckgo.com/' to URL -> https://start.duckduckgo.com/
  455. 10:24:28 DEBUG    webview    tabbedbrowser:tabopen:393 Creating new tab with URL PyQt5.QtCore.QUrl('https://start.duckduckgo.com/'), background False, explicit True, idx None
  456. 10:24:28 DEBUG    init       networkmanager:__init__:139 Initializing NetworkManager
  457. 10:24:28 DEBUG    init       networkmanager:__init__:144 NetworkManager init done
  458. 10:24:28 DEBUG    webview    tabbedbrowser:_get_new_tab_idx:455 new-tab-position last -> opening new tab at -1, next left: 0 / right: 1
  459. 10:24:28 DEBUG    webview    tabbedbrowser:on_title_changed:523 Changing title for idx 1 to 'https://start.duckduckgo.com/'
  460. 10:24:28 DEBUG    webview    webpage:acceptNavigationRequest:478 navigation request: url https://start.duckduckgo.com/, type NavigationTypeOther, target ClickTarget.normal override None
  461. 10:24:28 DEBUG    webview    browsertab:_set_load_status:627 load status for <qutebrowser.browser.webkit.webkittab.WebKitTab tab_id=1 url=''>: LoadStatus.loading
  462. 10:24:28 DEBUG    signals    signalfilter:_filter_signals:91 ignoring: cur_load_status_changed('loading') (tab 1)
  463. 10:24:28 DEBUG    signals    signalfilter:_filter_signals:91 ignoring: cur_load_started() (tab 1)
  464. 10:24:28 DEBUG    misc       app:on_focus_object_changed:779 Focus object changed: <qutebrowser.browser.webkit.webview.WebView tab_id=1 url=''>
  465. 10:24:28 DEBUG    modes      tabbedbrowser:on_current_changed:590 Current tab changed, focusing <qutebrowser.browser.webkit.webkittab.WebKitTab tab_id=1 url=''>
  466. 10:24:28 DEBUG    modes      modeman:leave:294 Ignoring leave request for KeyMode.hint (reason tab changed) as we're in mode KeyMode.normal
  467. 10:24:28 DEBUG    modes      modeman:leave:294 Ignoring leave request for KeyMode.insert (reason tab changed) as we're in mode KeyMode.normal
  468. 10:24:28 DEBUG    modes      modeman:leave:294 Ignoring leave request for KeyMode.caret (reason tab changed) as we're in mode KeyMode.normal
  469. 10:24:28 DEBUG    modes      modeman:leave:294 Ignoring leave request for KeyMode.passthrough (reason tab changed) as we're in mode KeyMode.normal
  470. 10:24:28 DEBUG    modes      modeman:_eventFilter_keypress:192 handled: True, forward-unbound-keys: auto, passthrough: True, is_non_alnum: True --> filter: True (focused: <qutebrowser.browser.webkit.webview.WebView tab_id=1 url=''>)
  471. 10:24:28 DEBUG    modes      modeman:_eventFilter_keyrelease:212 filter: True
  472. 10:24:29 DEBUG    webview    tabbedbrowser:on_title_changed:523 Changing title for idx 1 to 'https://start.duckduckgo.com/'
  473. 10:24:29 DEBUG    signals    signalfilter:_filter_signals:86 emitting: cur_url_changed(PyQt5.QtCore.QUrl('https://start.duckduckgo.com/')) (tab 1)
  474. 10:24:29 DEBUG    webview    tabbedbrowser:on_title_changed:515 Ignoring title change to ''.
  475. 10:24:29 DEBUG    webview    tabbedbrowser:on_title_changed:523 Changing title for idx 1 to 'DuckDuckGo'
  476. 10:24:31 DEBUG    save       savemanager:mark_dirty:72 Marking cookies as dirty.
  477. 10:24:31 DEBUG    save       savemanager:mark_dirty:72 Marking cookies as dirty.
  478. 10:24:31 DEBUG    save       savemanager:mark_dirty:72 Marking cookies as dirty.
  479. 10:24:31 DEBUG    save       savemanager:mark_dirty:72 Marking cookies as dirty.
  480. 10:24:31 DEBUG    save       savemanager:mark_dirty:72 Marking history as dirty.
  481. 10:24:31 DEBUG    webview    webpage:acceptNavigationRequest:478 navigation request: url https://start.duckduckgo.com/post2.html, type NavigationTypeOther, target ClickTarget.normal override None
  482. 10:24:31 DEBUG    save       savemanager:mark_dirty:72 Marking cookies as dirty.
  483. 10:24:31 DEBUG    save       savemanager:mark_dirty:72 Marking cookies as dirty.
  484. 10:24:31 DEBUG    save       savemanager:mark_dirty:72 Marking cookies as dirty.
  485. 10:24:31 DEBUG    save       savemanager:mark_dirty:72 Marking cookies as dirty.
  486. 10:24:32 DEBUG    sessions   sessions:save:280 Saving session _autosave to /home/dekks/.local/share/qutebrowser/sessions/_autosave.yml...
  487. 10:24:32 DEBUG    webview    browsertab:_set_load_status:627 load status for <qutebrowser.browser.webkit.webkittab.WebKitTab tab_id=1 url='https://start.duckduckgo.com/'>: LoadStatus.success_https
  488. 10:24:32 DEBUG    signals    signalfilter:_filter_signals:86 emitting: cur_load_status_changed('success_https') (tab 1)
  489. 10:24:32 DEBUG    signals    signalfilter:_filter_signals:86 emitting: cur_load_finished(True) (tab 1)
  490. 10:24:33 DEBUG    modes      modeman:_eventFilter_keypress:167 got keypress in mode KeyMode.normal - delegating to <qutebrowser.keyinput.modeparsers.NormalKeyParser>
  491. 10:24:33 DEBUG    keyboard   basekeyparser:_debug_log:112 No special binding found for i.
  492. 10:24:34 DEBUG    keyboard   basekeyparser:_debug_log:112 Got key: 0x49 / text: 'i'
  493. 10:24:34 DEBUG    keyboard   basekeyparser:_debug_log:112 Definitive match for 'i'.
  494. 10:24:34 DEBUG    keyboard   basekeyparser:_debug_log:112 discarding keystring 'i'.
  495. 10:24:34 DEBUG    commands   command:run:509 command called: enter-mode ['insert']
  496. 10:24:34 DEBUG    commands   command:run:524 Calling qutebrowser.keyinput.modeman.ModeManager.enter_mode(<qutebrowser.keyinput.modeman.ModeManager mode=<KeyMode.normal: 1>>, 'insert')
  497. 10:24:34 DEBUG    modes      modeman:enter:238 Entering mode KeyMode.insert (reason: command)
  498. 10:24:34 DEBUG    modes      modeman:leave:294 Ignoring leave request for KeyMode.hint (reason insert mode) as we're in mode KeyMode.insert
  499. 10:24:34 DEBUG    statusbar  text:set_text:55 Setting normal text to '-- INSERT MODE --'.
  500. 10:24:34 DEBUG    statusbar  bar:set_mode_active:236 Setting insert_active to True
  501. 10:24:34 DEBUG    modes      modeman:_eventFilter_keypress:192 handled: True, forward-unbound-keys: auto, passthrough: False, is_non_alnum: False --> filter: True (focused: <qutebrowser.browser.webkit.webview.WebView tab_id=1 url='https://start.duckduckgo.com/'>)
  502. 10:24:38 DEBUG    destroy    lineparser:_after_save:82 Saved to /home/dekks/.local/share/qutebrowser/cmd-history
  503. 10:24:38 DEBUG    destroy    lineparser:_after_save:82 Saved to /home/dekks/.local/share/qutebrowser/history
  504. 10:24:38 DEBUG    destroy    lineparser:_after_save:82 Saved to /home/dekks/.local/share/qutebrowser/cookies
  505. 10:24:40 DEBUG    webview    webpage:acceptNavigationRequest:478 navigation request: url https://duckduckgo.com/?q=emacs+loading+log, type NavigationTypeFormSubmitted, target ClickTarget.normal override None
  506. 10:24:40 DEBUG    webview    browsertab:_set_load_status:627 load status for <qutebrowser.browser.webkit.webkittab.WebKitTab tab_id=1 url='https://start.duckduckgo.com/'>: LoadStatus.loading
  507. 10:24:40 DEBUG    signals    signalfilter:_filter_signals:86 emitting: cur_load_status_changed('loading') (tab 1)
  508. 10:24:40 DEBUG    signals    signalfilter:_filter_signals:86 emitting: cur_load_started() (tab 1)
  509. 10:24:40 DEBUG    modes      modeman:leave:300 Leaving mode KeyMode.insert (reason: load started)
  510. 10:24:40 DEBUG    statusbar  text:set_text:55 Setting normal text to ''.
  511. 10:24:40 DEBUG    statusbar  bar:set_mode_active:236 Setting insert_active to False
  512. 10:24:40 DEBUG    modes      modeman:leave:294 Ignoring leave request for KeyMode.hint (reason load started) as we're in mode KeyMode.normal
  513. 10:24:40 DEBUG    modes      modeman:_eventFilter_keyrelease:212 filter: False
  514. 10:24:41 DEBUG    webview    tabbedbrowser:on_title_changed:523 Changing title for idx 1 to 'https://duckduckgo.com/?q=emacs+loading+log'
  515. 10:24:41 DEBUG    signals    signalfilter:_filter_signals:86 emitting: cur_url_changed(PyQt5.QtCore.QUrl('https://duckduckgo.com/?q=emacs+loading+log')) (tab 1)
  516. 10:24:41 DEBUG    webview    tabbedbrowser:on_title_changed:515 Ignoring title change to ''.
  517. 10:24:41 DEBUG    webview    tabbedbrowser:on_title_changed:523 Changing title for idx 1 to 'emacs loading log at DuckDuckGo'
  518. 10:24:42 DEBUG    save       savemanager:mark_dirty:72 Marking cookies as dirty.
  519. 10:24:42 DEBUG    save       savemanager:mark_dirty:72 Marking cookies as dirty.
  520. 10:24:42 DEBUG    save       savemanager:mark_dirty:72 Marking history as dirty.
  521. 10:24:42 DEBUG    webview    webpage:acceptNavigationRequest:478 navigation request: url https://duckduckgo.com/post2.html, type NavigationTypeOther, target ClickTarget.normal override None
  522. 10:24:42 DEBUG    sessions   sessions:save:280 Saving session _autosave to /home/dekks/.local/share/qutebrowser/sessions/_autosave.yml...
  523. 10:24:43 DEBUG    webview    browsertab:_set_load_status:627 load status for <qutebrowser.browser.webkit.webkittab.WebKitTab tab_id=1 url='https://duckduckgo.com/?q=emacs+loading+log'>: LoadStatus.success_https
  524. 10:24:43 DEBUG    signals    signalfilter:_filter_signals:86 emitting: cur_load_status_changed('success_https') (tab 1)
  525. 10:24:43 DEBUG    signals    signalfilter:_filter_signals:86 emitting: cur_load_finished(True) (tab 1)
  526. 10:24:43 DEBUG    signals    signalfilter:_filter_signals:86 emitting: cur_url_changed(PyQt5.QtCore.QUrl('https://duckduckgo.com/?q=emacs+loading+log&ia=qa')) (tab 1)
  527. 10:24:43 DEBUG    webview    tabbedbrowser:on_title_changed:515 Ignoring title change to ''.
  528. 10:24:43 DEBUG    sessions   sessions:save:280 Saving session _autosave to /home/dekks/.local/share/qutebrowser/sessions/_autosave.yml...
  529. 10:24:43 DEBUG    webview    browsertab:_set_load_status:627 load status for <qutebrowser.browser.webkit.webkittab.WebKitTab tab_id=1 url='https://duckduckgo.com/?q=emacs+loading+log&ia=qa'>: LoadStatus.success_https
  530. 10:24:43 DEBUG    signals    signalfilter:_filter_signals:86 emitting: cur_load_status_changed('success_https') (tab 1)
  531. 10:24:43 DEBUG    signals    signalfilter:_filter_signals:86 emitting: cur_load_finished(True) (tab 1)
  532. 10:24:52 DEBUG    webelem    webelem:is_editable:257 Checking if element is editable: <qutebrowser.browser.webkit.webkitelem.WebKitElement html='<a class="result__a" rel="noopener" href="https://superuser.com/questions/331407/emacs-fails-to-load-emacs-configuration-file"><b>Emacs</b> fails to load (.<b>emacs</b>) configuration file - Super User</a>'>
  533. 10:24:52 DEBUG    mouse      mouse:_mousepress_insertmode_cb:159 Clicked non-editable element!
  534. 10:24:52 DEBUG    modes      modeman:leave:294 Ignoring leave request for KeyMode.insert (reason click) as we're in mode KeyMode.normal
  535. 10:24:52 DEBUG    mouse      webview:mousePressEvent:299 Normal click, setting normal target
  536. 10:24:52 DEBUG    webview    webpage:acceptNavigationRequest:478 navigation request: url https://superuser.com/questions/331407/emacs-fails-to-load-emacs-configuration-file, type NavigationTypeOther, target ClickTarget.normal override None
  537. 10:24:52 DEBUG    webview    browsertab:_set_load_status:627 load status for <qutebrowser.browser.webkit.webkittab.WebKitTab tab_id=1 url='https://duckduckgo.com/?q=emacs+loading+log&ia=qa'>: LoadStatus.loading
  538. 10:24:52 DEBUG    signals    signalfilter:_filter_signals:86 emitting: cur_load_status_changed('loading') (tab 1)
  539. 10:24:52 DEBUG    signals    signalfilter:_filter_signals:86 emitting: cur_load_started() (tab 1)
  540. 10:24:52 DEBUG    modes      modeman:leave:294 Ignoring leave request for KeyMode.insert (reason load started) as we're in mode KeyMode.normal
  541. 10:24:52 DEBUG    modes      modeman:leave:294 Ignoring leave request for KeyMode.hint (reason load started) as we're in mode KeyMode.normal
  542. 10:24:53 DEBUG    webview    tabbedbrowser:on_title_changed:523 Changing title for idx 1 to 'https://superuser.com/questions/331407/emacs-fails-to-load-emacs-configuration-file'
  543. 10:24:53 DEBUG    signals    signalfilter:_filter_signals:86 emitting: cur_url_changed(PyQt5.QtCore.QUrl('https://superuser.com/questions/331407/emacs-fails-to-load-emacs-configuration-file')) (tab 1)
  544. 10:24:53 DEBUG    webview    tabbedbrowser:on_title_changed:515 Ignoring title change to ''.
  545. 10:24:53 DEBUG    webview    tabbedbrowser:on_title_changed:523 Changing title for idx 1 to 'Emacs fails to load (.emacs) configuration file - Super User'
  546. 10:24:53 INFO     webview    networkmanager:createRequest:422 Request to js-sec.indexww.com blocked by host blocker.
  547. 10:24:53 DEBUG    destroy    lineparser:_after_save:82 Saved to /home/dekks/.local/share/qutebrowser/history
  548. 10:24:53 DEBUG    destroy    lineparser:_after_save:82 Saved to /home/dekks/.local/share/qutebrowser/cookies
  549. 10:24:53 DEBUG    webview    webpage:acceptNavigationRequest:478 navigation request: url https://ssum-sec.casalemedia.com/usermatch?s=183712&cb=https%3A%2F%2Fengine.adzerk.net%2Fudb%2F22%2Fsync%2Fi.gif%3FpartnerId%3D1%26userId%3D, type NavigationTypeOther, target ClickTarget.normal override None
  550. 10:24:53 INFO     webview    networkmanager:createRequest:422 Request to ssum-sec.casalemedia.com blocked by host blocker.
  551. 10:24:53 INFO     webview    networkmanager:createRequest:422 Request to www.googletagservices.com blocked by host blocker.
  552. 10:24:54 INFO     webview    networkmanager:createRequest:422 Request to www.google-analytics.com blocked by host blocker.
  553. 10:24:54 INFO     webview    networkmanager:createRequest:422 Request to secure.quantserve.com blocked by host blocker.
  554. 10:24:54 INFO     webview    networkmanager:createRequest:422 Request to sb.scorecardresearch.com blocked by host blocker.
  555. 10:24:54 DEBUG    save       savemanager:mark_dirty:72 Marking history as dirty.
  556. 10:24:54 DEBUG    sessions   sessions:save:280 Saving session _autosave to /home/dekks/.local/share/qutebrowser/sessions/_autosave.yml...
  557. 10:24:55 DEBUG    webview    browsertab:_set_load_status:627 load status for <qutebrowser.browser.webkit.webkittab.WebKitTab tab_id=1 url='https://superuser.com/questions/331407/emacs-fails-to-load-emacs-configuration-file'>: LoadStatus.success_https
  558. 10:24:55 DEBUG    signals    signalfilter:_filter_signals:86 emitting: cur_load_status_changed('success_https') (tab 1)
  559. 10:24:55 DEBUG    signals    signalfilter:_filter_signals:86 emitting: cur_load_finished(True) (tab 1)
  560. 10:25:01 DEBUG    modes      modeman:_eventFilter_keypress:167 got keypress in mode KeyMode.normal - delegating to <qutebrowser.keyinput.modeparsers.NormalKeyParser>
  561. 10:25:01 DEBUG    keyboard   basekeyparser:_debug_log:112 No special binding found for pgdown.
  562. 10:25:01 DEBUG    keyboard   basekeyparser:_debug_log:112 Got key: 0x1000017 / text: ''
  563. 10:25:01 DEBUG    keyboard   basekeyparser:_debug_log:112 Ignoring, no text char
  564. 10:25:01 DEBUG    modes      modeman:_eventFilter_keypress:192 handled: False, forward-unbound-keys: auto, passthrough: False, is_non_alnum: True --> filter: False (focused: <qutebrowser.browser.webkit.webview.WebView tab_id=1 url='https://superuser.com/questions/331407/emacs-fails-to-load-emacs-configuration-file'>)
  565. 10:25:01 DEBUG    modes      modeman:_eventFilter_keyrelease:212 filter: False
  566. 10:25:05 DEBUG    modes      modeman:_eventFilter_keypress:167 got keypress in mode KeyMode.normal - delegating to <qutebrowser.keyinput.modeparsers.NormalKeyParser>
  567. 10:25:05 DEBUG    keyboard   basekeyparser:_debug_log:112 No special binding found for pgdown.
  568. 10:25:05 DEBUG    keyboard   basekeyparser:_debug_log:112 Got key: 0x1000017 / text: ''
  569. 10:25:05 DEBUG    keyboard   basekeyparser:_debug_log:112 Ignoring, no text char
  570. 10:25:05 DEBUG    modes      modeman:_eventFilter_keypress:192 handled: False, forward-unbound-keys: auto, passthrough: False, is_non_alnum: True --> filter: False (focused: <qutebrowser.browser.webkit.webview.WebView tab_id=1 url='https://superuser.com/questions/331407/emacs-fails-to-load-emacs-configuration-file'>)
  571. 10:25:05 DEBUG    modes      modeman:_eventFilter_keyrelease:212 filter: False
  572. 10:25:08 DEBUG    destroy    lineparser:_after_save:82 Saved to /home/dekks/.local/share/qutebrowser/history
  573. 10:25:40 DEBUG    modes      modeman:_eventFilter_keypress:167 got keypress in mode KeyMode.normal - delegating to <qutebrowser.keyinput.modeparsers.NormalKeyParser>
  574. 10:25:40 DEBUG    commands   command:run:509 command called: back
  575. 10:25:40 DEBUG    commands   command:run:524 Calling qutebrowser.browser.commands.CommandDispatcher.back(<qutebrowser.browser.commands.CommandDispatcher>, False, False, False, 1)
  576. 10:25:40 DEBUG    webview    webpage:acceptNavigationRequest:478 navigation request: url https://duckduckgo.com/?q=emacs+loading+log&ia=qa, type NavigationTypeBackOrForward, target ClickTarget.normal override None
  577. 10:25:40 DEBUG    webview    browsertab:_set_load_status:627 load status for <qutebrowser.browser.webkit.webkittab.WebKitTab tab_id=1 url='https://superuser.com/questions/331407/emacs-fails-to-load-emacs-configuration-file'>: LoadStatus.loading
  578. 10:25:40 DEBUG    signals    signalfilter:_filter_signals:86 emitting: cur_load_status_changed('loading') (tab 1)
  579. 10:25:40 DEBUG    signals    signalfilter:_filter_signals:86 emitting: cur_load_started() (tab 1)
  580. 10:25:40 DEBUG    modes      modeman:leave:294 Ignoring leave request for KeyMode.insert (reason load started) as we're in mode KeyMode.normal
  581. 10:25:40 DEBUG    modes      modeman:leave:294 Ignoring leave request for KeyMode.hint (reason load started) as we're in mode KeyMode.normal
  582. 10:25:40 DEBUG    modes      modeman:_eventFilter_keypress:192 handled: True, forward-unbound-keys: auto, passthrough: False, is_non_alnum: True --> filter: True (focused: <qutebrowser.browser.webkit.webview.WebView tab_id=1 url='https://superuser.com/questions/331407/emacs-fails-to-load-emacs-configuration-file'>)
  583. 10:25:41 DEBUG    modes      modeman:_eventFilter_keyrelease:212 filter: True
  584. 10:25:41 DEBUG    webview    tabbedbrowser:on_title_changed:523 Changing title for idx 1 to 'https://duckduckgo.com/?q=emacs+loading+log&ia=qa'
  585. 10:25:41 DEBUG    signals    signalfilter:_filter_signals:86 emitting: cur_url_changed(PyQt5.QtCore.QUrl('https://duckduckgo.com/?q=emacs+loading+log&ia=qa')) (tab 1)
  586. 10:25:41 DEBUG    webview    tabbedbrowser:on_title_changed:515 Ignoring title change to ''.
  587. 10:25:41 DEBUG    webview    tabbedbrowser:on_title_changed:523 Changing title for idx 1 to 'emacs loading log at DuckDuckGo'
  588. 10:25:41 DEBUG    save       savemanager:mark_dirty:72 Marking cookies as dirty.
  589. 10:25:41 DEBUG    save       savemanager:mark_dirty:72 Marking cookies as dirty.
  590. 10:25:41 DEBUG    save       savemanager:mark_dirty:72 Marking history as dirty.
  591. 10:25:41 DEBUG    webview    webpage:acceptNavigationRequest:478 navigation request: url https://duckduckgo.com/post2.html, type NavigationTypeBackOrForward, target ClickTarget.normal override None
  592. 10:25:42 DEBUG    sessions   sessions:save:280 Saving session _autosave to /home/dekks/.local/share/qutebrowser/sessions/_autosave.yml...
  593. 10:25:42 DEBUG    webview    browsertab:_set_load_status:627 load status for <qutebrowser.browser.webkit.webkittab.WebKitTab tab_id=1 url='https://duckduckgo.com/?q=emacs+loading+log&ia=qa'>: LoadStatus.success_https
  594. 10:25:42 DEBUG    signals    signalfilter:_filter_signals:86 emitting: cur_load_status_changed('success_https') (tab 1)
  595. 10:25:42 DEBUG    signals    signalfilter:_filter_signals:86 emitting: cur_load_finished(True) (tab 1)
  596. 10:25:49 DEBUG    modes      modeman:_eventFilter_keypress:167 got keypress in mode KeyMode.normal - delegating to <qutebrowser.keyinput.modeparsers.NormalKeyParser>
  597. 10:25:49 DEBUG    keyboard   basekeyparser:_debug_log:112 No special binding found for pgdown.
  598. 10:25:49 DEBUG    keyboard   basekeyparser:_debug_log:112 Got key: 0x1000017 / text: ''
  599. 10:25:49 DEBUG    keyboard   basekeyparser:_debug_log:112 Ignoring, no text char
  600. 10:25:49 DEBUG    modes      modeman:_eventFilter_keypress:192 handled: False, forward-unbound-keys: auto, passthrough: False, is_non_alnum: True --> filter: False (focused: <qutebrowser.browser.webkit.webview.WebView tab_id=1 url='https://duckduckgo.com/?q=emacs+loading+log&ia=qa'>)
  601. 10:25:49 DEBUG    modes      modeman:_eventFilter_keyrelease:212 filter: False
  602. 10:25:53 DEBUG    destroy    lineparser:_after_save:82 Saved to /home/dekks/.local/share/qutebrowser/history
  603. 10:25:53 DEBUG    destroy    lineparser:_after_save:82 Saved to /home/dekks/.local/share/qutebrowser/cookies
  604. 10:25:57 DEBUG    modes      modeman:_eventFilter_keypress:167 got keypress in mode KeyMode.normal - delegating to <qutebrowser.keyinput.modeparsers.NormalKeyParser>
  605. 10:25:57 DEBUG    keyboard   basekeyparser:_debug_log:112 No special binding found for pgdown.
  606. 10:25:57 DEBUG    keyboard   basekeyparser:_debug_log:112 Got key: 0x1000017 / text: ''
  607. 10:25:57 DEBUG    keyboard   basekeyparser:_debug_log:112 Ignoring, no text char
  608. 10:25:57 DEBUG    modes      modeman:_eventFilter_keypress:192 handled: False, forward-unbound-keys: auto, passthrough: False, is_non_alnum: True --> filter: False (focused: <qutebrowser.browser.webkit.webview.WebView tab_id=1 url='https://duckduckgo.com/?q=emacs+loading+log&ia=qa'>)
  609. 10:25:57 DEBUG    modes      modeman:_eventFilter_keyrelease:212 filter: False
  610. 10:26:05 DEBUG    webelem    webelem:is_editable:257 Checking if element is editable: <qutebrowser.browser.webkit.webkitelem.WebKitElement html='<a class="result__a" rel="noopener" href="https://stackoverflow.com/questions/37713699/slow-emacs-startup">Slow <b>emacs</b> startup - Stack Overflow</a>'>
  611. 10:26:05 DEBUG    mouse      mouse:_mousepress_insertmode_cb:159 Clicked non-editable element!
  612. 10:26:05 DEBUG    modes      modeman:leave:294 Ignoring leave request for KeyMode.insert (reason click) as we're in mode KeyMode.normal
  613. 10:26:05 DEBUG    mouse      webview:mousePressEvent:299 Normal click, setting normal target
  614. 10:26:05 DEBUG    webview    webpage:acceptNavigationRequest:478 navigation request: url https://stackoverflow.com/questions/37713699/slow-emacs-startup, type NavigationTypeOther, target ClickTarget.normal override None
  615. 10:26:05 DEBUG    webview    browsertab:_set_load_status:627 load status for <qutebrowser.browser.webkit.webkittab.WebKitTab tab_id=1 url='https://duckduckgo.com/?q=emacs+loading+log&ia=qa'>: LoadStatus.loading
  616. 10:26:05 DEBUG    signals    signalfilter:_filter_signals:86 emitting: cur_load_status_changed('loading') (tab 1)
  617. 10:26:05 DEBUG    signals    signalfilter:_filter_signals:86 emitting: cur_load_started() (tab 1)
  618. 10:26:05 DEBUG    modes      modeman:leave:294 Ignoring leave request for KeyMode.insert (reason load started) as we're in mode KeyMode.normal
  619. 10:26:05 DEBUG    modes      modeman:leave:294 Ignoring leave request for KeyMode.hint (reason load started) as we're in mode KeyMode.normal
  620. 10:26:11 DEBUG    webview    tabbedbrowser:on_title_changed:523 Changing title for idx 1 to 'https://stackoverflow.com/questions/37713699/slow-emacs-startup'
  621. 10:26:11 DEBUG    signals    signalfilter:_filter_signals:86 emitting: cur_url_changed(PyQt5.QtCore.QUrl('https://stackoverflow.com/questions/37713699/slow-emacs-startup')) (tab 1)
  622. 10:26:11 DEBUG    webview    tabbedbrowser:on_title_changed:515 Ignoring title change to ''.
  623. 10:26:11 DEBUG    webview    tabbedbrowser:on_title_changed:523 Changing title for idx 1 to 'Slow emacs startup - Stack Overflow'
  624. 10:26:11 DEBUG    save       savemanager:mark_dirty:72 Marking history as dirty.
  625. 10:26:11 INFO     webview    networkmanager:createRequest:422 Request to www.googletagservices.com blocked by host blocker.
  626. 10:26:12 INFO     webview    networkmanager:createRequest:422 Request to www.google-analytics.com blocked by host blocker.
  627. 10:26:12 INFO     webview    networkmanager:createRequest:422 Request to secure.quantserve.com blocked by host blocker.
  628. 10:26:12 INFO     webview    networkmanager:createRequest:422 Request to sb.scorecardresearch.com blocked by host blocker.
  629. 10:26:12 DEBUG    sessions   sessions:save:280 Saving session _autosave to /home/dekks/.local/share/qutebrowser/sessions/_autosave.yml...
  630. 10:26:12 DEBUG    webview    browsertab:_set_load_status:627 load status for <qutebrowser.browser.webkit.webkittab.WebKitTab tab_id=1 url='https://stackoverflow.com/questions/37713699/slow-emacs-startup'>: LoadStatus.success_https
  631. 10:26:12 DEBUG    signals    signalfilter:_filter_signals:86 emitting: cur_load_status_changed('success_https') (tab 1)
  632. 10:26:12 DEBUG    signals    signalfilter:_filter_signals:86 emitting: cur_load_finished(True) (tab 1)
  633. 10:26:15 DEBUG    modes      modeman:_eventFilter_keypress:167 got keypress in mode KeyMode.normal - delegating to <qutebrowser.keyinput.modeparsers.NormalKeyParser>
  634. 10:26:15 DEBUG    keyboard   basekeyparser:_debug_log:112 No special binding found for pgdown.
  635. 10:26:15 DEBUG    keyboard   basekeyparser:_debug_log:112 Got key: 0x1000017 / text: ''
  636. 10:26:15 DEBUG    keyboard   basekeyparser:_debug_log:112 Ignoring, no text char
  637. 10:26:15 DEBUG    modes      modeman:_eventFilter_keypress:192 handled: False, forward-unbound-keys: auto, passthrough: False, is_non_alnum: True --> filter: False (focused: <qutebrowser.browser.webkit.webview.WebView tab_id=1 url='https://stackoverflow.com/questions/37713699/slow-emacs-startup'>)
  638. 10:26:15 DEBUG    modes      modeman:_eventFilter_keyrelease:212 filter: False
  639. 10:26:23 DEBUG    destroy    lineparser:_after_save:82 Saved to /home/dekks/.local/share/qutebrowser/history
  640. 10:26:26 DEBUG    modes      modeman:_eventFilter_keypress:167 got keypress in mode KeyMode.normal - delegating to <qutebrowser.keyinput.modeparsers.NormalKeyParser>
  641. 10:26:26 DEBUG    keyboard   basekeyparser:_debug_log:112 No special binding found for pgdown.
  642. 10:26:26 DEBUG    keyboard   basekeyparser:_debug_log:112 Got key: 0x1000017 / text: ''
  643. 10:26:26 DEBUG    keyboard   basekeyparser:_debug_log:112 Ignoring, no text char
  644. 10:26:26 DEBUG    modes      modeman:_eventFilter_keypress:192 handled: False, forward-unbound-keys: auto, passthrough: False, is_non_alnum: True --> filter: False (focused: <qutebrowser.browser.webkit.webview.WebView tab_id=1 url='https://stackoverflow.com/questions/37713699/slow-emacs-startup'>)
  645. 10:26:26 DEBUG    modes      modeman:_eventFilter_keyrelease:212 filter: False
  646. 10:26:31 DEBUG    modes      modeman:_eventFilter_keypress:167 got keypress in mode KeyMode.normal - delegating to <qutebrowser.keyinput.modeparsers.NormalKeyParser>
  647. 10:26:31 DEBUG    keyboard   basekeyparser:_debug_log:112 No special binding found for pgdown.
  648. 10:26:31 DEBUG    keyboard   basekeyparser:_debug_log:112 Got key: 0x1000017 / text: ''
  649. 10:26:31 DEBUG    keyboard   basekeyparser:_debug_log:112 Ignoring, no text char
  650. 10:26:31 DEBUG    modes      modeman:_eventFilter_keypress:192 handled: False, forward-unbound-keys: auto, passthrough: False, is_non_alnum: True --> filter: False (focused: <qutebrowser.browser.webkit.webview.WebView tab_id=1 url='https://stackoverflow.com/questions/37713699/slow-emacs-startup'>)
  651. 10:26:31 DEBUG    modes      modeman:_eventFilter_keyrelease:212 filter: False
  652. 10:26:32 DEBUG    modes      modeman:_eventFilter_keypress:167 got keypress in mode KeyMode.normal - delegating to <qutebrowser.keyinput.modeparsers.NormalKeyParser>
  653. 10:26:32 DEBUG    keyboard   basekeyparser:_debug_log:112 No special binding found for pgup.
  654. 10:26:32 DEBUG    keyboard   basekeyparser:_debug_log:112 Got key: 0x1000016 / text: ''
  655. 10:26:32 DEBUG    keyboard   basekeyparser:_debug_log:112 Ignoring, no text char
  656. 10:26:32 DEBUG    modes      modeman:_eventFilter_keypress:192 handled: False, forward-unbound-keys: auto, passthrough: False, is_non_alnum: True --> filter: False (focused: <qutebrowser.browser.webkit.webview.WebView tab_id=1 url='https://stackoverflow.com/questions/37713699/slow-emacs-startup'>)
  657. 10:26:32 DEBUG    modes      modeman:_eventFilter_keyrelease:212 filter: False
  658. 10:26:32 DEBUG    modes      modeman:_eventFilter_keypress:167 got keypress in mode KeyMode.normal - delegating to <qutebrowser.keyinput.modeparsers.NormalKeyParser>
  659. 10:26:32 DEBUG    keyboard   basekeyparser:_debug_log:112 No special binding found for pgup.
  660. 10:26:32 DEBUG    keyboard   basekeyparser:_debug_log:112 Got key: 0x1000016 / text: ''
  661. 10:26:32 DEBUG    keyboard   basekeyparser:_debug_log:112 Ignoring, no text char
  662. 10:26:32 DEBUG    modes      modeman:_eventFilter_keypress:192 handled: False, forward-unbound-keys: auto, passthrough: False, is_non_alnum: True --> filter: False (focused: <qutebrowser.browser.webkit.webview.WebView tab_id=1 url='https://stackoverflow.com/questions/37713699/slow-emacs-startup'>)
  663. 10:26:33 DEBUG    modes      modeman:_eventFilter_keyrelease:212 filter: False
  664. 10:26:33 DEBUG    modes      modeman:_eventFilter_keypress:167 got keypress in mode KeyMode.normal - delegating to <qutebrowser.keyinput.modeparsers.NormalKeyParser>
  665. 10:26:33 DEBUG    keyboard   basekeyparser:_debug_log:112 No special binding found for pgup.
  666. 10:26:33 DEBUG    keyboard   basekeyparser:_debug_log:112 Got key: 0x1000016 / text: ''
  667. 10:26:33 DEBUG    keyboard   basekeyparser:_debug_log:112 Ignoring, no text char
  668. 10:26:33 DEBUG    modes      modeman:_eventFilter_keypress:192 handled: False, forward-unbound-keys: auto, passthrough: False, is_non_alnum: True --> filter: False (focused: <qutebrowser.browser.webkit.webview.WebView tab_id=1 url='https://stackoverflow.com/questions/37713699/slow-emacs-startup'>)
  669. 10:26:33 DEBUG    modes      modeman:_eventFilter_keyrelease:212 filter: False
  670. 10:26:33 DEBUG    modes      modeman:_eventFilter_keypress:167 got keypress in mode KeyMode.normal - delegating to <qutebrowser.keyinput.modeparsers.NormalKeyParser>
  671. 10:26:33 DEBUG    keyboard   basekeyparser:_debug_log:112 No special binding found for pgup.
  672. 10:26:33 DEBUG    keyboard   basekeyparser:_debug_log:112 Got key: 0x1000016 / text: ''
  673. 10:26:33 DEBUG    keyboard   basekeyparser:_debug_log:112 Ignoring, no text char
  674. 10:26:33 DEBUG    modes      modeman:_eventFilter_keypress:192 handled: False, forward-unbound-keys: auto, passthrough: False, is_non_alnum: True --> filter: False (focused: <qutebrowser.browser.webkit.webview.WebView tab_id=1 url='https://stackoverflow.com/questions/37713699/slow-emacs-startup'>)
  675. 10:26:33 DEBUG    modes      modeman:_eventFilter_keyrelease:212 filter: False
  676. 10:26:33 DEBUG    modes      modeman:_eventFilter_keypress:167 got keypress in mode KeyMode.normal - delegating to <qutebrowser.keyinput.modeparsers.NormalKeyParser>
  677. 10:26:33 DEBUG    keyboard   basekeyparser:_debug_log:112 No special binding found for pgup.
  678. 10:26:33 DEBUG    keyboard   basekeyparser:_debug_log:112 Got key: 0x1000016 / text: ''
  679. 10:26:33 DEBUG    keyboard   basekeyparser:_debug_log:112 Ignoring, no text char
  680. 10:26:33 DEBUG    modes      modeman:_eventFilter_keypress:192 handled: False, forward-unbound-keys: auto, passthrough: False, is_non_alnum: True --> filter: False (focused: <qutebrowser.browser.webkit.webview.WebView tab_id=1 url='https://stackoverflow.com/questions/37713699/slow-emacs-startup'>)
  681. 10:26:33 DEBUG    modes      modeman:_eventFilter_keyrelease:212 filter: False
  682. 10:26:33 DEBUG    modes      modeman:_eventFilter_keypress:167 got keypress in mode KeyMode.normal - delegating to <qutebrowser.keyinput.modeparsers.NormalKeyParser>
  683. 10:26:33 DEBUG    keyboard   basekeyparser:_debug_log:112 No special binding found for pgup.
  684. 10:26:33 DEBUG    keyboard   basekeyparser:_debug_log:112 Got key: 0x1000016 / text: ''
  685. 10:26:33 DEBUG    keyboard   basekeyparser:_debug_log:112 Ignoring, no text char
  686. 10:26:33 DEBUG    modes      modeman:_eventFilter_keypress:192 handled: False, forward-unbound-keys: auto, passthrough: False, is_non_alnum: True --> filter: False (focused: <qutebrowser.browser.webkit.webview.WebView tab_id=1 url='https://stackoverflow.com/questions/37713699/slow-emacs-startup'>)
  687. 10:26:33 DEBUG    modes      modeman:_eventFilter_keyrelease:212 filter: False
  688. 10:26:34 DEBUG    modes      modeman:_eventFilter_keypress:167 got keypress in mode KeyMode.normal - delegating to <qutebrowser.keyinput.modeparsers.NormalKeyParser>
  689. 10:26:34 DEBUG    keyboard   basekeyparser:_debug_log:112 No special binding found for pgup.
  690. 10:26:34 DEBUG    keyboard   basekeyparser:_debug_log:112 Got key: 0x1000016 / text: ''
  691. 10:26:34 DEBUG    keyboard   basekeyparser:_debug_log:112 Ignoring, no text char
  692. 10:26:34 DEBUG    modes      modeman:_eventFilter_keypress:192 handled: False, forward-unbound-keys: auto, passthrough: False, is_non_alnum: True --> filter: False (focused: <qutebrowser.browser.webkit.webview.WebView tab_id=1 url='https://stackoverflow.com/questions/37713699/slow-emacs-startup'>)
  693. 10:26:34 DEBUG    modes      modeman:_eventFilter_keyrelease:212 filter: False
  694. 10:26:34 DEBUG    modes      modeman:_eventFilter_keypress:167 got keypress in mode KeyMode.normal - delegating to <qutebrowser.keyinput.modeparsers.NormalKeyParser>
  695. 10:26:34 DEBUG    keyboard   basekeyparser:_debug_log:112 No special binding found for pgup.
  696. 10:26:34 DEBUG    keyboard   basekeyparser:_debug_log:112 Got key: 0x1000016 / text: ''
  697. 10:26:34 DEBUG    keyboard   basekeyparser:_debug_log:112 Ignoring, no text char
  698. 10:26:34 DEBUG    modes      modeman:_eventFilter_keypress:192 handled: False, forward-unbound-keys: auto, passthrough: False, is_non_alnum: True --> filter: False (focused: <qutebrowser.browser.webkit.webview.WebView tab_id=1 url='https://stackoverflow.com/questions/37713699/slow-emacs-startup'>)
  699. 10:26:34 DEBUG    modes      modeman:_eventFilter_keyrelease:212 filter: False
  700. 10:26:34 DEBUG    modes      modeman:_eventFilter_keypress:167 got keypress in mode KeyMode.normal - delegating to <qutebrowser.keyinput.modeparsers.NormalKeyParser>
  701. 10:26:34 DEBUG    keyboard   basekeyparser:_debug_log:112 No special binding found for pgup.
  702. 10:26:34 DEBUG    keyboard   basekeyparser:_debug_log:112 Got key: 0x1000016 / text: ''
  703. 10:26:34 DEBUG    keyboard   basekeyparser:_debug_log:112 Ignoring, no text char
  704. 10:26:34 DEBUG    modes      modeman:_eventFilter_keypress:192 handled: False, forward-unbound-keys: auto, passthrough: False, is_non_alnum: True --> filter: False (focused: <qutebrowser.browser.webkit.webview.WebView tab_id=1 url='https://stackoverflow.com/questions/37713699/slow-emacs-startup'>)
  705. 10:26:34 DEBUG    modes      modeman:_eventFilter_keyrelease:212 filter: False
  706. 10:26:34 DEBUG    modes      modeman:_eventFilter_keypress:167 got keypress in mode KeyMode.normal - delegating to <qutebrowser.keyinput.modeparsers.NormalKeyParser>
  707. 10:26:34 DEBUG    keyboard   basekeyparser:_debug_log:112 No special binding found for pgup.
  708. 10:26:34 DEBUG    keyboard   basekeyparser:_debug_log:112 Got key: 0x1000016 / text: ''
  709. 10:26:34 DEBUG    keyboard   basekeyparser:_debug_log:112 Ignoring, no text char
  710. 10:26:34 DEBUG    modes      modeman:_eventFilter_keypress:192 handled: False, forward-unbound-keys: auto, passthrough: False, is_non_alnum: True --> filter: False (focused: <qutebrowser.browser.webkit.webview.WebView tab_id=1 url='https://stackoverflow.com/questions/37713699/slow-emacs-startup'>)
  711. 10:26:34 DEBUG    modes      modeman:_eventFilter_keyrelease:212 filter: False
  712. 10:26:36 DEBUG    modes      modeman:_eventFilter_keypress:167 got keypress in mode KeyMode.normal - delegating to <qutebrowser.keyinput.modeparsers.NormalKeyParser>
  713. 10:26:36 DEBUG    keyboard   basekeyparser:_debug_log:112 Ignoring only-modifier keyeevent.
  714. 10:26:36 DEBUG    keyboard   basekeyparser:_debug_log:112 Got key: 0x1000023 / text: ''
  715. 10:26:36 DEBUG    keyboard   basekeyparser:_debug_log:112 Ignoring, no text char
  716. 10:26:36 DEBUG    modes      modeman:_eventFilter_keypress:192 handled: False, forward-unbound-keys: auto, passthrough: False, is_non_alnum: True --> filter: False (focused: <qutebrowser.browser.webkit.webview.WebView tab_id=1 url='https://stackoverflow.com/questions/37713699/slow-emacs-startup'>)
  717. 10:26:36 DEBUG    misc       app:on_focus_object_changed:779 Focus object changed: None
  718. 10:28:33 DEBUG    misc       app:on_focus_object_changed:779 Focus object changed: <qutebrowser.browser.webkit.webview.WebView tab_id=1 url='https://stackoverflow.com/questions/37713699/slow-emacs-startup'>
  719. 10:28:33 DEBUG    modes      modeman:_eventFilter_keyrelease:212 filter: False
  720. 10:28:36 DEBUG    modes      modeman:_eventFilter_keypress:167 got keypress in mode KeyMode.normal - delegating to <qutebrowser.keyinput.modeparsers.NormalKeyParser>
  721. 10:28:36 DEBUG    commands   command:run:509 command called: back
  722. 10:28:36 DEBUG    commands   command:run:524 Calling qutebrowser.browser.commands.CommandDispatcher.back(<qutebrowser.browser.commands.CommandDispatcher>, False, False, False, 1)
  723. 10:28:36 DEBUG    webview    webpage:acceptNavigationRequest:478 navigation request: url https://duckduckgo.com/?q=emacs+loading+log&ia=qa, type NavigationTypeBackOrForward, target ClickTarget.normal override None
  724. 10:28:36 DEBUG    webview    browsertab:_set_load_status:627 load status for <qutebrowser.browser.webkit.webkittab.WebKitTab tab_id=1 url='https://stackoverflow.com/questions/37713699/slow-emacs-startup'>: LoadStatus.loading
  725. 10:28:36 DEBUG    signals    signalfilter:_filter_signals:86 emitting: cur_load_status_changed('loading') (tab 1)
  726. 10:28:36 DEBUG    signals    signalfilter:_filter_signals:86 emitting: cur_load_started() (tab 1)
  727. 10:28:36 DEBUG    modes      modeman:leave:294 Ignoring leave request for KeyMode.insert (reason load started) as we're in mode KeyMode.normal
  728. 10:28:36 DEBUG    modes      modeman:leave:294 Ignoring leave request for KeyMode.hint (reason load started) as we're in mode KeyMode.normal
  729. 10:28:36 DEBUG    modes      modeman:_eventFilter_keypress:192 handled: True, forward-unbound-keys: auto, passthrough: False, is_non_alnum: True --> filter: True (focused: <qutebrowser.browser.webkit.webview.WebView tab_id=1 url='https://stackoverflow.com/questions/37713699/slow-emacs-startup'>)
  730. 10:28:36 DEBUG    modes      modeman:_eventFilter_keyrelease:212 filter: True
  731. 10:28:36 DEBUG    webview    tabbedbrowser:on_title_changed:523 Changing title for idx 1 to 'https://duckduckgo.com/?q=emacs+loading+log&ia=qa'
  732. 10:28:36 DEBUG    signals    signalfilter:_filter_signals:86 emitting: cur_url_changed(PyQt5.QtCore.QUrl('https://duckduckgo.com/?q=emacs+loading+log&ia=qa')) (tab 1)
  733. 10:28:36 DEBUG    webview    tabbedbrowser:on_title_changed:515 Ignoring title change to ''.
  734. 10:28:36 DEBUG    webview    tabbedbrowser:on_title_changed:523 Changing title for idx 1 to 'emacs loading log at DuckDuckGo'
  735. 10:28:36 DEBUG    save       savemanager:mark_dirty:72 Marking cookies as dirty.
  736. 10:28:36 DEBUG    save       savemanager:mark_dirty:72 Marking cookies as dirty.
  737. 10:28:37 DEBUG    save       savemanager:mark_dirty:72 Marking history as dirty.
  738. 10:28:37 DEBUG    webview    webpage:acceptNavigationRequest:478 navigation request: url https://duckduckgo.com/post2.html, type NavigationTypeBackOrForward, target ClickTarget.normal override None
  739. 10:28:37 DEBUG    sessions   sessions:save:280 Saving session _autosave to /home/dekks/.local/share/qutebrowser/sessions/_autosave.yml...
  740. 10:28:37 DEBUG    webview    browsertab:_set_load_status:627 load status for <qutebrowser.browser.webkit.webkittab.WebKitTab tab_id=1 url='https://duckduckgo.com/?q=emacs+loading+log&ia=qa'>: LoadStatus.success_https
  741. 10:28:37 DEBUG    signals    signalfilter:_filter_signals:86 emitting: cur_load_status_changed('success_https') (tab 1)
  742. 10:28:37 DEBUG    signals    signalfilter:_filter_signals:86 emitting: cur_load_finished(True) (tab 1)
  743. 10:28:38 DEBUG    destroy    lineparser:_after_save:82 Saved to /home/dekks/.local/share/qutebrowser/history
  744. 10:28:38 DEBUG    destroy    lineparser:_after_save:82 Saved to /home/dekks/.local/share/qutebrowser/cookies
  745. 10:28:41 DEBUG    modes      modeman:_eventFilter_keypress:167 got keypress in mode KeyMode.normal - delegating to <qutebrowser.keyinput.modeparsers.NormalKeyParser>
  746. 10:28:41 DEBUG    commands   command:run:509 command called: back
  747. 10:28:41 DEBUG    commands   command:run:524 Calling qutebrowser.browser.commands.CommandDispatcher.back(<qutebrowser.browser.commands.CommandDispatcher>, False, False, False, 1)
  748. 10:28:41 DEBUG    webview    webpage:acceptNavigationRequest:478 navigation request: url https://start.duckduckgo.com/, type NavigationTypeBackOrForward, target ClickTarget.normal override None
  749. 10:28:41 DEBUG    webview    browsertab:_set_load_status:627 load status for <qutebrowser.browser.webkit.webkittab.WebKitTab tab_id=1 url='https://duckduckgo.com/?q=emacs+loading+log&ia=qa'>: LoadStatus.loading
  750. 10:28:41 DEBUG    signals    signalfilter:_filter_signals:86 emitting: cur_load_status_changed('loading') (tab 1)
  751. 10:28:41 DEBUG    signals    signalfilter:_filter_signals:86 emitting: cur_load_started() (tab 1)
  752. 10:28:41 DEBUG    modes      modeman:leave:294 Ignoring leave request for KeyMode.insert (reason load started) as we're in mode KeyMode.normal
  753. 10:28:41 DEBUG    modes      modeman:leave:294 Ignoring leave request for KeyMode.hint (reason load started) as we're in mode KeyMode.normal
  754. 10:28:41 DEBUG    modes      modeman:_eventFilter_keypress:192 handled: True, forward-unbound-keys: auto, passthrough: False, is_non_alnum: True --> filter: True (focused: <qutebrowser.browser.webkit.webview.WebView tab_id=1 url='https://duckduckgo.com/?q=emacs+loading+log&ia=qa'>)
  755. 10:28:41 DEBUG    modes      modeman:_eventFilter_keyrelease:212 filter: True
  756. 10:28:42 DEBUG    webview    tabbedbrowser:on_title_changed:523 Changing title for idx 1 to 'https://start.duckduckgo.com/'
  757. 10:28:42 DEBUG    signals    signalfilter:_filter_signals:86 emitting: cur_url_changed(PyQt5.QtCore.QUrl('https://start.duckduckgo.com/')) (tab 1)
  758. 10:28:42 DEBUG    webview    tabbedbrowser:on_title_changed:515 Ignoring title change to ''.
  759. 10:28:42 DEBUG    webview    tabbedbrowser:on_title_changed:523 Changing title for idx 1 to 'DuckDuckGo'
  760. 10:28:42 DEBUG    save       savemanager:mark_dirty:72 Marking cookies as dirty.
  761. 10:28:42 DEBUG    save       savemanager:mark_dirty:72 Marking cookies as dirty.
  762. 10:28:42 DEBUG    save       savemanager:mark_dirty:72 Marking cookies as dirty.
  763. 10:28:42 DEBUG    save       savemanager:mark_dirty:72 Marking cookies as dirty.
  764. 10:28:42 DEBUG    save       savemanager:mark_dirty:72 Marking history as dirty.
  765. 10:28:42 DEBUG    webview    webpage:acceptNavigationRequest:478 navigation request: url https://start.duckduckgo.com/post2.html, type NavigationTypeBackOrForward, target ClickTarget.normal override None
  766. 10:28:42 DEBUG    save       savemanager:mark_dirty:72 Marking cookies as dirty.
  767. 10:28:42 DEBUG    save       savemanager:mark_dirty:72 Marking cookies as dirty.
  768. 10:28:42 DEBUG    save       savemanager:mark_dirty:72 Marking cookies as dirty.
  769. 10:28:42 DEBUG    save       savemanager:mark_dirty:72 Marking cookies as dirty.
  770. 10:28:42 DEBUG    sessions   sessions:save:280 Saving session _autosave to /home/dekks/.local/share/qutebrowser/sessions/_autosave.yml...
  771. 10:28:42 DEBUG    webview    browsertab:_set_load_status:627 load status for <qutebrowser.browser.webkit.webkittab.WebKitTab tab_id=1 url='https://start.duckduckgo.com/'>: LoadStatus.success_https
  772. 10:28:42 DEBUG    signals    signalfilter:_filter_signals:86 emitting: cur_load_status_changed('success_https') (tab 1)
  773. 10:28:42 DEBUG    signals    signalfilter:_filter_signals:86 emitting: cur_load_finished(True) (tab 1)
  774. 10:28:45 DEBUG    modes      modeman:_eventFilter_keypress:167 got keypress in mode KeyMode.normal - delegating to <qutebrowser.keyinput.modeparsers.NormalKeyParser>
  775. 10:28:45 DEBUG    keyboard   basekeyparser:_debug_log:112 No special binding found for i.
  776. 10:28:45 DEBUG    keyboard   basekeyparser:_debug_log:112 Got key: 0x49 / text: 'i'
  777. 10:28:45 DEBUG    keyboard   basekeyparser:_debug_log:112 Definitive match for 'i'.
  778. 10:28:45 DEBUG    keyboard   basekeyparser:_debug_log:112 discarding keystring 'i'.
  779. 10:28:45 DEBUG    commands   command:run:509 command called: enter-mode ['insert']
  780. 10:28:45 DEBUG    commands   command:run:524 Calling qutebrowser.keyinput.modeman.ModeManager.enter_mode(<qutebrowser.keyinput.modeman.ModeManager mode=<KeyMode.normal: 1>>, 'insert')
  781. 10:28:45 DEBUG    modes      modeman:enter:238 Entering mode KeyMode.insert (reason: command)
  782. 10:28:45 DEBUG    modes      modeman:leave:294 Ignoring leave request for KeyMode.hint (reason insert mode) as we're in mode KeyMode.insert
  783. 10:28:45 DEBUG    statusbar  text:set_text:55 Setting normal text to '-- INSERT MODE --'.
  784. 10:28:45 DEBUG    statusbar  bar:set_mode_active:236 Setting insert_active to True
  785. 10:28:45 DEBUG    modes      modeman:_eventFilter_keypress:192 handled: True, forward-unbound-keys: auto, passthrough: False, is_non_alnum: False --> filter: True (focused: <qutebrowser.browser.webkit.webview.WebView tab_id=1 url='https://start.duckduckgo.com/'>)
  786. 10:28:52 DEBUG    webview    webpage:acceptNavigationRequest:478 navigation request: url https://duckduckgo.com/?q=emacs+error+log, type NavigationTypeFormSubmitted, target ClickTarget.normal override None
  787. 10:28:52 DEBUG    webview    browsertab:_set_load_status:627 load status for <qutebrowser.browser.webkit.webkittab.WebKitTab tab_id=1 url='https://start.duckduckgo.com/'>: LoadStatus.loading
  788. 10:28:52 DEBUG    signals    signalfilter:_filter_signals:86 emitting: cur_load_status_changed('loading') (tab 1)
  789. 10:28:52 DEBUG    signals    signalfilter:_filter_signals:86 emitting: cur_load_started() (tab 1)
  790. 10:28:52 DEBUG    modes      modeman:leave:300 Leaving mode KeyMode.insert (reason: load started)
  791. 10:28:52 DEBUG    statusbar  text:set_text:55 Setting normal text to ''.
  792. 10:28:52 DEBUG    statusbar  bar:set_mode_active:236 Setting insert_active to False
  793. 10:28:52 DEBUG    modes      modeman:leave:294 Ignoring leave request for KeyMode.hint (reason load started) as we're in mode KeyMode.normal
  794. 10:28:52 DEBUG    modes      modeman:_eventFilter_keyrelease:212 filter: False
  795. 10:28:52 DEBUG    webview    tabbedbrowser:on_title_changed:523 Changing title for idx 1 to 'https://duckduckgo.com/?q=emacs+error+log'
  796. 10:28:52 DEBUG    signals    signalfilter:_filter_signals:86 emitting: cur_url_changed(PyQt5.QtCore.QUrl('https://duckduckgo.com/?q=emacs+error+log')) (tab 1)
  797. 10:28:52 DEBUG    webview    tabbedbrowser:on_title_changed:515 Ignoring title change to ''.
  798. 10:28:52 DEBUG    webview    tabbedbrowser:on_title_changed:523 Changing title for idx 1 to 'emacs error log at DuckDuckGo'
  799. 10:28:53 DEBUG    save       savemanager:mark_dirty:72 Marking cookies as dirty.
  800. 10:28:53 DEBUG    save       savemanager:mark_dirty:72 Marking cookies as dirty.
  801. 10:28:53 DEBUG    save       savemanager:mark_dirty:72 Marking history as dirty.
  802. 10:28:53 DEBUG    webview    webpage:acceptNavigationRequest:478 navigation request: url https://duckduckgo.com/post2.html, type NavigationTypeOther, target ClickTarget.normal override None
  803. 10:28:53 DEBUG    destroy    lineparser:_after_save:82 Saved to /home/dekks/.local/share/qutebrowser/history
  804. 10:28:53 DEBUG    destroy    lineparser:_after_save:82 Saved to /home/dekks/.local/share/qutebrowser/cookies
  805. 10:28:53 DEBUG    sessions   sessions:save:280 Saving session _autosave to /home/dekks/.local/share/qutebrowser/sessions/_autosave.yml...
  806. 10:28:53 DEBUG    webview    browsertab:_set_load_status:627 load status for <qutebrowser.browser.webkit.webkittab.WebKitTab tab_id=1 url='https://duckduckgo.com/?q=emacs+error+log'>: LoadStatus.success_https
  807. 10:28:53 DEBUG    signals    signalfilter:_filter_signals:86 emitting: cur_load_status_changed('success_https') (tab 1)
  808. 10:28:53 DEBUG    signals    signalfilter:_filter_signals:86 emitting: cur_load_finished(True) (tab 1)
  809. 10:28:54 DEBUG    signals    signalfilter:_filter_signals:86 emitting: cur_url_changed(PyQt5.QtCore.QUrl('https://duckduckgo.com/?q=emacs+error+log&ia=web')) (tab 1)
  810. 10:28:54 DEBUG    webview    tabbedbrowser:on_title_changed:515 Ignoring title change to ''.
  811. 10:28:54 DEBUG    sessions   sessions:save:280 Saving session _autosave to /home/dekks/.local/share/qutebrowser/sessions/_autosave.yml...
  812. 10:28:54 DEBUG    webview    browsertab:_set_load_status:627 load status for <qutebrowser.browser.webkit.webkittab.WebKitTab tab_id=1 url='https://duckduckgo.com/?q=emacs+error+log&ia=web'>: LoadStatus.success_https
  813. 10:28:54 DEBUG    signals    signalfilter:_filter_signals:86 emitting: cur_load_status_changed('success_https') (tab 1)
  814. 10:28:54 DEBUG    signals    signalfilter:_filter_signals:86 emitting: cur_load_finished(True) (tab 1)
  815. 10:29:04 DEBUG    webelem    webelem:is_editable:257 Checking if element is editable: <qutebrowser.browser.webkit.webkitelem.WebKitElement html='<b>emacs</b>'>
  816. 10:29:04 DEBUG    mouse      mouse:_mousepress_insertmode_cb:159 Clicked non-editable element!
  817. 10:29:04 DEBUG    modes      modeman:leave:294 Ignoring leave request for KeyMode.insert (reason click) as we're in mode KeyMode.normal
  818. 10:29:04 DEBUG    mouse      webview:mousePressEvent:299 Normal click, setting normal target
  819. 10:29:04 DEBUG    webview    webpage:acceptNavigationRequest:478 navigation request: url https://kb.iu.edu/d/abue, type NavigationTypeOther, target ClickTarget.normal override None
  820. 10:29:04 DEBUG    webview    browsertab:_set_load_status:627 load status for <qutebrowser.browser.webkit.webkittab.WebKitTab tab_id=1 url='https://duckduckgo.com/?q=emacs+error+log&ia=web'>: LoadStatus.loading
  821. 10:29:04 DEBUG    signals    signalfilter:_filter_signals:86 emitting: cur_load_status_changed('loading') (tab 1)
  822. 10:29:04 DEBUG    signals    signalfilter:_filter_signals:86 emitting: cur_load_started() (tab 1)
  823. 10:29:04 DEBUG    modes      modeman:leave:294 Ignoring leave request for KeyMode.insert (reason load started) as we're in mode KeyMode.normal
  824. 10:29:04 DEBUG    modes      modeman:leave:294 Ignoring leave request for KeyMode.hint (reason load started) as we're in mode KeyMode.normal
  825. 10:29:05 DEBUG    save       savemanager:mark_dirty:72 Marking cookies as dirty.
  826. 10:29:05 DEBUG    webview    tabbedbrowser:on_title_changed:523 Changing title for idx 1 to 'https://kb.iu.edu/d/abue'
  827. 10:29:05 DEBUG    signals    signalfilter:_filter_signals:86 emitting: cur_url_changed(PyQt5.QtCore.QUrl('https://kb.iu.edu/d/abue')) (tab 1)
  828. 10:29:05 DEBUG    webview    tabbedbrowser:on_title_changed:515 Ignoring title change to ''.
  829. 10:29:05 DEBUG    webview    tabbedbrowser:on_title_changed:523 Changing title for idx 1 to 'For Emacs, how do I debug a .emacs file?'
  830. 10:29:07 DEBUG    save       savemanager:mark_dirty:72 Marking history as dirty.
  831. 10:29:07 INFO     webview    networkmanager:createRequest:422 Request to www.google-analytics.com blocked by host blocker.
  832. 10:29:08 DEBUG    destroy    lineparser:_after_save:82 Saved to /home/dekks/.local/share/qutebrowser/history
  833. 10:29:08 DEBUG    destroy    lineparser:_after_save:82 Saved to /home/dekks/.local/share/qutebrowser/cookies
  834. 10:29:13 DEBUG    sessions   sessions:save:280 Saving session _autosave to /home/dekks/.local/share/qutebrowser/sessions/_autosave.yml...
  835. 10:29:13 DEBUG    webview    browsertab:_set_load_status:627 load status for <qutebrowser.browser.webkit.webkittab.WebKitTab tab_id=1 url='https://kb.iu.edu/d/abue'>: LoadStatus.success_https
  836. 10:29:13 DEBUG    signals    signalfilter:_filter_signals:86 emitting: cur_load_status_changed('success_https') (tab 1)
  837. 10:29:13 DEBUG    signals    signalfilter:_filter_signals:86 emitting: cur_load_finished(True) (tab 1)
  838. 10:29:28 DEBUG    modes      modeman:_eventFilter_keypress:167 got keypress in mode KeyMode.normal - delegating to <qutebrowser.keyinput.modeparsers.NormalKeyParser>
  839. 10:29:28 DEBUG    keyboard   basekeyparser:_debug_log:112 Ignoring only-modifier keyeevent.
  840. 10:29:28 DEBUG    keyboard   basekeyparser:_debug_log:112 Got key: 0x1000023 / text: ''
  841. 10:29:28 DEBUG    keyboard   basekeyparser:_debug_log:112 Ignoring, no text char
  842. 10:29:28 DEBUG    modes      modeman:_eventFilter_keypress:192 handled: False, forward-unbound-keys: auto, passthrough: False, is_non_alnum: True --> filter: False (focused: <qutebrowser.browser.webkit.webview.WebView tab_id=1 url='https://kb.iu.edu/d/abue'>)
  843. 10:29:29 DEBUG    misc       app:on_focus_object_changed:779 Focus object changed: None
  844. 10:32:09 DEBUG    misc       app:on_focus_object_changed:779 Focus object changed: <qutebrowser.browser.webkit.webview.WebView tab_id=1 url='https://kb.iu.edu/d/abue'>
  845. 10:32:09 DEBUG    modes      modeman:_eventFilter_keyrelease:212 filter: False
  846. 10:32:52 DEBUG    modes      modeman:_eventFilter_keypress:167 got keypress in mode KeyMode.normal - delegating to <qutebrowser.keyinput.modeparsers.NormalKeyParser>
  847. 10:32:52 DEBUG    keyboard   basekeyparser:_debug_log:112 Ignoring only-modifier keyeevent.
  848. 10:32:52 DEBUG    keyboard   basekeyparser:_debug_log:112 Got key: 0x1000023 / text: ''
  849. 10:32:52 DEBUG    keyboard   basekeyparser:_debug_log:112 Ignoring, no text char
  850. 10:32:52 DEBUG    modes      modeman:_eventFilter_keypress:192 handled: False, forward-unbound-keys: auto, passthrough: False, is_non_alnum: True --> filter: False (focused: <qutebrowser.browser.webkit.webview.WebView tab_id=1 url='https://kb.iu.edu/d/abue'>)
  851. 10:32:53 DEBUG    misc       app:on_focus_object_changed:779 Focus object changed: None
  852. 10:33:21 DEBUG    misc       app:on_focus_object_changed:779 Focus object changed: <qutebrowser.browser.webkit.webview.WebView tab_id=1 url='https://kb.iu.edu/d/abue'>
  853. 10:33:21 DEBUG    modes      modeman:_eventFilter_keyrelease:212 filter: False
  854. 10:33:24 DEBUG    modes      modeman:_eventFilter_keypress:167 got keypress in mode KeyMode.normal - delegating to <qutebrowser.keyinput.modeparsers.NormalKeyParser>
  855. 10:33:24 DEBUG    keyboard   basekeyparser:_debug_log:112 Ignoring only-modifier keyeevent.
  856. 10:33:24 DEBUG    keyboard   basekeyparser:_debug_log:112 Got key: 0x1000023 / text: ''
  857. 10:33:24 DEBUG    keyboard   basekeyparser:_debug_log:112 Ignoring, no text char
  858. 10:33:24 DEBUG    modes      modeman:_eventFilter_keypress:192 handled: False, forward-unbound-keys: auto, passthrough: False, is_non_alnum: True --> filter: False (focused: <qutebrowser.browser.webkit.webview.WebView tab_id=1 url='https://kb.iu.edu/d/abue'>)
  859. 10:33:24 DEBUG    misc       app:on_focus_object_changed:779 Focus object changed: None
  860. 10:35:20 DEBUG    misc       app:on_focus_object_changed:779 Focus object changed: <qutebrowser.browser.webkit.webview.WebView tab_id=1 url='https://kb.iu.edu/d/abue'>
  861. 10:35:20 DEBUG    modes      modeman:_eventFilter_keyrelease:212 filter: False
  862. 10:35:50 DEBUG    modes      modeman:_eventFilter_keypress:167 got keypress in mode KeyMode.normal - delegating to <qutebrowser.keyinput.modeparsers.NormalKeyParser>
  863. 10:35:50 DEBUG    keyboard   basekeyparser:_debug_log:112 Ignoring only-modifier keyeevent.
  864. 10:35:50 DEBUG    keyboard   basekeyparser:_debug_log:112 Got key: 0x1000023 / text: ''
  865. 10:35:50 DEBUG    keyboard   basekeyparser:_debug_log:112 Ignoring, no text char
  866. 10:35:50 DEBUG    modes      modeman:_eventFilter_keypress:192 handled: False, forward-unbound-keys: auto, passthrough: False, is_non_alnum: True --> filter: False (focused: <qutebrowser.browser.webkit.webview.WebView tab_id=1 url='https://kb.iu.edu/d/abue'>)
  867. 10:35:50 DEBUG    misc       app:on_focus_object_changed:779 Focus object changed: None
  868. 10:50:34 DEBUG    misc       app:on_focus_object_changed:779 Focus object changed: <qutebrowser.browser.webkit.webview.WebView tab_id=1 url='https://kb.iu.edu/d/abue'>
  869. 10:50:38 DEBUG    modes      modeman:_eventFilter_keypress:167 got keypress in mode KeyMode.normal - delegating to <qutebrowser.keyinput.modeparsers.NormalKeyParser>
  870. 10:50:38 DEBUG    keyboard   basekeyparser:_debug_log:112 No special binding found for b.
  871. 10:50:38 DEBUG    keyboard   basekeyparser:_debug_log:112 Got key: 0x42 / text: 'b'
  872. 10:50:38 DEBUG    keyboard   basekeyparser:_debug_log:112 Definitive match for 'b'.
  873. 10:50:38 DEBUG    keyboard   basekeyparser:_debug_log:112 discarding keystring 'b'.
  874. 10:50:38 DEBUG    commands   command:run:509 command called: set-cmd-text ['-s', ':quickmark-load']
  875. 10:50:38 DEBUG    commands   command:run:524 Calling qutebrowser.mainwindow.statusbar.command.Command.set_cmd_text_command(<qutebrowser.mainwindow.statusbar.command.Command>, ':quickmark-load', True, False)
  876. 10:50:38 DEBUG    completion completer:schedule_completion_update:222 Scheduling completion update.
  877. 10:50:38 DEBUG    completion completer:schedule_completion_update:219 Ignoring update because there were no changes.
  878. 10:50:38 DEBUG    modes      command:set_cmd_text:87 Setting command text, focusing <qutebrowser.mainwindow.statusbar.command.Command>
  879. 10:50:38 DEBUG    modes      modeman:enter:238 Entering mode KeyMode.command (reason: cmd focus)
  880. 10:50:38 DEBUG    statusbar  text:set_text:55 Setting normal text to '-- COMMAND MODE --'.
  881. 10:50:38 DEBUG    statusbar  bar:set_mode_active:239 Setting command_active to True
  882. 10:50:38 DEBUG    webview    webview:on_mode_entered:164 Ignoring focus because mode KeyMode.command was entered.
  883. 10:50:38 DEBUG    webview    webview:on_mode_entered:164 Ignoring focus because mode KeyMode.command was entered.
  884. 10:50:38 DEBUG    misc       app:on_focus_object_changed:779 Focus object changed: <qutebrowser.mainwindow.statusbar.command.Command>
  885. 10:50:38 DEBUG    misc       app:on_focus_object_changed:779 Focus object changed: <qutebrowser.browser.webkit.webview.WebView tab_id=1 url='https://kb.iu.edu/d/abue'>
  886. 10:50:38 DEBUG    misc       app:on_focus_object_changed:779 Focus object changed: <qutebrowser.mainwindow.statusbar.command.Command>
  887. 10:50:38 DEBUG    modes      modeman:_eventFilter_keypress:192 handled: True, forward-unbound-keys: auto, passthrough: False, is_non_alnum: False --> filter: True (focused: <qutebrowser.mainwindow.statusbar.command.Command>)
  888. 10:50:38 DEBUG    completion completer:_partition:162 partitioning ['quickmark-load', ' '] around position 15
  889. 10:50:38 DEBUG    completion completer:_partition:174 partitioned: ['quickmark-load'] '' []
  890. 10:50:38 DEBUG    completion completer:_update_completion:249 Updating completion: ['quickmark-load']  []
  891. 10:50:38 DEBUG    completion completer:_get_new_completion:107 Before removing flags: ['quickmark-load']
  892. 10:50:38 DEBUG    completion completer:_get_new_completion:109 After removing flags: ['quickmark-load']
  893. 10:50:38 DEBUG    completion completer:_update_completion:256 Setting completion model to QuickmarkCompletionModel with pattern ''
  894. 10:50:38 DEBUG    misc       mainwindow:_update_overlay_geometry:267 new geometry for <qutebrowser.completion.completionwidget.CompletionView>: PyQt5.QtCore.QRect(0, 358, 1021, 373)
  895. 10:50:38 DEBUG    completion debug:__exit__:260 Setting filter pattern took 0.000243 seconds.
  896. 10:50:38 DEBUG    modes      modeman:_eventFilter_keyrelease:212 filter: True
  897. 10:50:40 DEBUG    modes      modeman:_eventFilter_keypress:167 got keypress in mode KeyMode.command - delegating to <qutebrowser.keyinput.keyparser.PassthroughKeyParser mode='command' warn=True>
  898. 10:50:40 DEBUG    commands   command:run:509 command called: completion-item-focus ['next']
  899. 10:50:40 DEBUG    commands   command:run:524 Calling qutebrowser.completion.completionwidget.CompletionView.completion_item_focus(<qutebrowser.completion.completionwidget.CompletionView>, 'next')
  900. 10:50:40 DEBUG    completion completer:_partition:162 partitioning ['quickmark-load', ' '] around position 15
  901. 10:50:40 DEBUG    completion completer:_partition:174 partitioned: ['quickmark-load'] '' []
  902. 10:50:40 DEBUG    completion completer:on_selection_changed:189 Changing  to 'DDG'
  903. 10:50:40 DEBUG    completion completer:on_selection_changed:206 Will ignore next completion update.
  904. 10:50:40 DEBUG    completion completer:_change_completed_part:278 setting text = ':quickmark-load DDG', pos = 19
  905. 10:50:40 DEBUG    completion completer:schedule_completion_update:222 Scheduling completion update.
  906. 10:50:40 DEBUG    completion completer:schedule_completion_update:219 Ignoring update because there were no changes.
  907. 10:50:40 DEBUG    modes      modeman:_eventFilter_keypress:192 handled: True, forward-unbound-keys: auto, passthrough: True, is_non_alnum: True --> filter: True (focused: <qutebrowser.mainwindow.statusbar.command.Command>)
  908. 10:50:40 DEBUG    completion completer:_update_completion:231 Ignoring completion update because ignore_change is True.
  909. 10:50:40 DEBUG    modes      modeman:_eventFilter_keyrelease:212 filter: True
  910. 10:50:44 DEBUG    webelem    webelem:is_editable:257 Checking if element is editable: <qutebrowser.browser.webkit.webkitelem.WebKitElement html='<nav role="navigation" class="nav-inline text-right"><ul><li class="default"><a href="/">Home</a></li><li class="default"><a href="/d/menu">Menu</a></li><li class="default"><a href="/d/line">About us</a></li></ul></nav>'>
  911. 10:50:44 DEBUG    mouse      mouse:_mousepress_insertmode_cb:159 Clicked non-editable element!
  912. 10:50:44 DEBUG    modes      modeman:leave:294 Ignoring leave request for KeyMode.insert (reason click) as we're in mode KeyMode.command
  913. 10:50:44 DEBUG    mouse      webview:mousePressEvent:299 Normal click, setting normal target
  914. 10:50:47 DEBUG    modes      modeman:_eventFilter_keypress:167 got keypress in mode KeyMode.command - delegating to <qutebrowser.keyinput.keyparser.PassthroughKeyParser mode='command' warn=True>
  915. 10:50:47 DEBUG    commands   command:run:509 command called: leave-mode
  916. 10:50:47 DEBUG    commands   command:run:524 Calling qutebrowser.keyinput.modeman.ModeManager.leave_current_mode(<qutebrowser.keyinput.modeman.ModeManager mode=<KeyMode.command: 3>>)
  917. 10:50:47 DEBUG    modes      modeman:leave:300 Leaving mode KeyMode.command (reason: leave current)
  918. 10:50:47 DEBUG    statusbar  text:set_text:55 Setting normal text to ''.
  919. 10:50:47 DEBUG    statusbar  bar:set_mode_active:239 Setting command_active to False
  920. 10:50:47 DEBUG    completion completer:schedule_completion_update:222 Scheduling completion update.
  921. 10:50:47 DEBUG    completion completer:schedule_completion_update:219 Ignoring update because there were no changes.
  922. 10:50:47 DEBUG    statusbar  bar:_hide_cmd_widget:272 Hiding cmd widget
  923. 10:50:47 DEBUG    misc       app:on_focus_object_changed:779 Focus object changed: <qutebrowser.mainwindow.mainwindow.MainWindow>
  924. 10:50:47 DEBUG    misc       app:on_focus_object_changed:779 Focus object changed: <qutebrowser.mainwindow.statusbar.text.Text text=''>
  925. 10:50:47 DEBUG    modes      tabbedbrowser:on_mode_left:573 Left status-input mode, focusing <qutebrowser.browser.webkit.webkittab.WebKitTab tab_id=1 url='https://kb.iu.edu/d/abue'>
  926. 10:50:47 DEBUG    misc       app:on_focus_object_changed:779 Focus object changed: <qutebrowser.browser.webkit.webview.WebView tab_id=1 url='https://kb.iu.edu/d/abue'>
  927. 10:50:47 DEBUG    webview    webview:on_mode_left:177 Restoring focus policy because mode KeyMode.command was left.
  928. 10:50:47 DEBUG    webview    webview:on_mode_left:177 Restoring focus policy because mode KeyMode.command was left.
  929. 10:50:47 DEBUG    modes      modeman:_eventFilter_keypress:192 handled: True, forward-unbound-keys: auto, passthrough: True, is_non_alnum: False --> filter: True (focused: <qutebrowser.browser.webkit.webview.WebView tab_id=1 url='https://kb.iu.edu/d/abue'>)
  930. 10:50:47 DEBUG    modes      modeman:_eventFilter_keyrelease:212 filter: True
  931. 10:50:49 DEBUG    misc       app:on_focus_object_changed:779 Focus object changed: <qutebrowser.browser.webkit.webview.WebView tab_id=0 url='https://www.reddit.com/'>
  932. 10:50:49 DEBUG    modes      tabbedbrowser:on_current_changed:590 Current tab changed, focusing <qutebrowser.browser.webkit.webkittab.WebKitTab tab_id=0 url='https://www.reddit.com/'>
  933. 10:50:49 DEBUG    modes      modeman:leave:294 Ignoring leave request for KeyMode.hint (reason tab changed) as we're in mode KeyMode.normal
  934. 10:50:49 DEBUG    modes      modeman:leave:294 Ignoring leave request for KeyMode.insert (reason tab changed) as we're in mode KeyMode.normal
  935. 10:50:49 DEBUG    modes      modeman:leave:294 Ignoring leave request for KeyMode.caret (reason tab changed) as we're in mode KeyMode.normal
  936. 10:50:49 DEBUG    modes      modeman:leave:294 Ignoring leave request for KeyMode.passthrough (reason tab changed) as we're in mode KeyMode.normal
  937. 10:50:49 DEBUG    save       savemanager:mark_dirty:72 Marking cookies as dirty.
  938. 10:50:49 DEBUG    webview    webpage:acceptNavigationRequest:478 navigation request: url https://www.redditmedia.com/moat/proxy#, type NavigationTypeOther, target ClickTarget.normal override None
  939. 10:50:49 INFO     webview    networkmanager:createRequest:422 Request to pixel.redditmedia.com blocked by host blocker.
  940. 10:50:50 INFO     webview    networkmanager:createRequest:422 Request to pixel.redditmedia.com blocked by host blocker.
  941. 10:50:50 WARNING  qt         Unknown module:none:0 QNetworkDiskCache::prepare() unable to open temporary file
  942.   File "/usr/bin/qutebrowser", line 11, in <module>
  943.     load_entry_point('qutebrowser==0.10.1', 'gui_scripts', 'qutebrowser')()
  944.   File "/usr/lib/python3/dist-packages/qutebrowser/qutebrowser.py", line 169, in main
  945.     return app.run(args)
  946.   File "/usr/lib/python3/dist-packages/qutebrowser/app.py", line 113, in run
  947.     ret = qt_mainloop()
  948.   File "/usr/lib/python3/dist-packages/qutebrowser/app.py", line 123, in qt_mainloop
  949.     return qApp.exec_()
  950.   File "/usr/lib/python3/dist-packages/qutebrowser/browser/webkit/cache.py", line 150, in prepare
  951.     return super().prepare(meta_data)
  952.   File "/usr/lib/python3/dist-packages/qutebrowser/utils/log.py", line 459, in qt_message_handler
  953.     stack = ''.join(traceback.format_stack())
  954.  
  955. 10:50:50 WARNING  qt         Unknown module:none:0 QNetworkDiskCache::prepare() unable to open temporary file
  956.   File "/usr/bin/qutebrowser", line 11, in <module>
  957.     load_entry_point('qutebrowser==0.10.1', 'gui_scripts', 'qutebrowser')()
  958.   File "/usr/lib/python3/dist-packages/qutebrowser/qutebrowser.py", line 169, in main
  959.     return app.run(args)
  960.   File "/usr/lib/python3/dist-packages/qutebrowser/app.py", line 113, in run
  961.     ret = qt_mainloop()
  962.   File "/usr/lib/python3/dist-packages/qutebrowser/app.py", line 123, in qt_mainloop
  963.     return qApp.exec_()
  964.   File "/usr/lib/python3/dist-packages/qutebrowser/browser/webkit/cache.py", line 150, in prepare
  965.     return super().prepare(meta_data)
  966.   File "/usr/lib/python3/dist-packages/qutebrowser/utils/log.py", line 459, in qt_message_handler
  967.     stack = ''.join(traceback.format_stack())
  968.  
  969. 10:50:50 INFO     webview    networkmanager:createRequest:422 Request to z.moatads.com blocked by host blocker.
  970. 10:50:52 DEBUG    webelem    webelem:is_editable:257 Checking if element is editable: <qutebrowser.browser.webkit.webkitelem.WebKitElement html='<a class="title may-blank loggedin " data-event-action="title" href="/r/corgi/comments/73fdn8/we_lost_gizmo_to_cancer_today_you_brightened_our/" tabindex="1" data-href-url="/r/corgi/comments/73fdn8/we_lost_gizmo_to_cancer_today_you_brightened_our/" data-inbound-url="/r/corgi/comments/73fdn8/we_lost_gizmo_to_cancer_today_you_brightened_our/?utm_content=title&amp;utm_medium=hot&amp;utm_source=reddit&amp;utm_name=frontpage" rel="">We lost Gizmo to cancer today. You brightened our lives and our hea…'>
  971. 10:50:52 DEBUG    mouse      mouse:_mousepress_insertmode_cb:159 Clicked non-editable element!
  972. 10:50:52 DEBUG    modes      modeman:leave:294 Ignoring leave request for KeyMode.insert (reason click) as we're in mode KeyMode.normal
  973. 10:50:52 DEBUG    mouse      webview:mousePressEvent:299 Normal click, setting normal target
  974. 10:50:52 DEBUG    save       savemanager:mark_dirty:72 Marking cookies as dirty.
  975. 10:50:52 DEBUG    webview    webpage:acceptNavigationRequest:478 navigation request: url https://www.reddit.com/r/corgi/comments/73fdn8/we_lost_gizmo_to_cancer_today_you_brightened_our/?utm_content=title&utm_medium=hot&utm_source=reddit&utm_name=frontpage, type NavigationTypeLinkClicked, target ClickTarget.normal override None
  976. 10:50:52 DEBUG    webview    browsertab:_set_load_status:627 load status for <qutebrowser.browser.webkit.webkittab.WebKitTab tab_id=0 url='https://www.reddit.com/'>: LoadStatus.loading
  977. 10:50:52 DEBUG    signals    signalfilter:_filter_signals:86 emitting: cur_load_status_changed('loading') (tab 0)
  978. 10:50:52 DEBUG    signals    signalfilter:_filter_signals:86 emitting: cur_load_started() (tab 0)
  979. 10:50:52 DEBUG    modes      modeman:leave:294 Ignoring leave request for KeyMode.insert (reason load started) as we're in mode KeyMode.normal
  980. 10:50:52 DEBUG    modes      modeman:leave:294 Ignoring leave request for KeyMode.hint (reason load started) as we're in mode KeyMode.normal
  981. 10:50:53 DEBUG    message    message:_log_stack:46 Stack for error message:
  982.   File "/usr/bin/qutebrowser", line 11, in <module>
  983.     load_entry_point('qutebrowser==0.10.1', 'gui_scripts', 'qutebrowser')()
  984.   File "/usr/lib/python3/dist-packages/qutebrowser/qutebrowser.py", line 169, in main
  985.     return app.run(args)
  986.   File "/usr/lib/python3/dist-packages/qutebrowser/app.py", line 113, in run
  987.     ret = qt_mainloop()
  988.   File "/usr/lib/python3/dist-packages/qutebrowser/app.py", line 123, in qt_mainloop
  989.     return qApp.exec_()
  990.   File "/usr/lib/python3/dist-packages/qutebrowser/misc/savemanager.py", line 183, in autosave
  991.     message.error("Failed to auto-save {}: {}".format(key, e))
  992.   File "/usr/lib/python3/dist-packages/qutebrowser/utils/message.py", line 58, in error
  993.     stack = traceback.format_stack()
  994. 10:50:53 ERROR    message    message:error:63 Failed to auto-save cookies: Existing file /home/dekks/.local/share/qutebrowser/cookies is not writable
  995. 10:50:53 DEBUG    misc       mainwindow:_update_overlay_geometry:267 new geometry for <qutebrowser.mainwindow.messageview.MessageView object at 0x9e93b14c>: PyQt5.QtCore.QRect(0, 713, 1021, 18)
  996. 10:50:53 DEBUG    save       savemanager:mark_dirty:72 Marking cookies as dirty.
  997. 10:50:53 WARNING  qt         Unknown module:none:0 QNetworkDiskCache::prepare() unable to open temporary file
  998.   File "/usr/bin/qutebrowser", line 11, in <module>
  999.     load_entry_point('qutebrowser==0.10.1', 'gui_scripts', 'qutebrowser')()
  1000.   File "/usr/lib/python3/dist-packages/qutebrowser/qutebrowser.py", line 169, in main
  1001.     return app.run(args)
  1002.   File "/usr/lib/python3/dist-packages/qutebrowser/app.py", line 113, in run
  1003.     ret = qt_mainloop()
  1004.   File "/usr/lib/python3/dist-packages/qutebrowser/app.py", line 123, in qt_mainloop
  1005.     return qApp.exec_()
  1006.   File "/usr/lib/python3/dist-packages/qutebrowser/browser/webkit/cache.py", line 150, in prepare
  1007.     return super().prepare(meta_data)
  1008.   File "/usr/lib/python3/dist-packages/qutebrowser/utils/log.py", line 459, in qt_message_handler
  1009.     stack = ''.join(traceback.format_stack())
  1010.  
  1011. 10:50:53 DEBUG    webview    tabbedbrowser:on_title_changed:523 Changing title for idx 0 to 'https://www.reddit.com/r/corgi/comments/73fdn8/we_lost_gizmo_to_cancer_today_you_brightened_our/?utm_content=title&utm_medium=hot&utm_source=reddit&utm_name=frontpage'
  1012. 10:50:53 DEBUG    signals    signalfilter:_filter_signals:86 emitting: cur_url_changed(PyQt5.QtCore.QUrl('https://www.reddit.com/r/corgi/comments/73fdn8/we_lost_gizmo_to_cancer_today_you_brightened_our/?utm_content=title&utm_medium=hot&utm_source=reddit&utm_name=frontpage')) (tab 0)
  1013. 10:50:53 DEBUG    webview    tabbedbrowser:on_title_changed:515 Ignoring title change to ''.
  1014. 10:50:53 DEBUG    webview    tabbedbrowser:on_title_changed:523 Changing title for idx 0 to 'We lost Gizmo to cancer today. You brightened our lives and our hearts. RIP :( : corgi'
  1015. 10:50:54 WARNING  qt         Unknown module:none:0 QNetworkDiskCache::prepare() unable to open temporary file
  1016.   File "/usr/bin/qutebrowser", line 11, in <module>
  1017.     load_entry_point('qutebrowser==0.10.1', 'gui_scripts', 'qutebrowser')()
  1018.   File "/usr/lib/python3/dist-packages/qutebrowser/qutebrowser.py", line 169, in main
  1019.     return app.run(args)
  1020.   File "/usr/lib/python3/dist-packages/qutebrowser/app.py", line 113, in run
  1021.     ret = qt_mainloop()
  1022.   File "/usr/lib/python3/dist-packages/qutebrowser/app.py", line 123, in qt_mainloop
  1023.     return qApp.exec_()
  1024.   File "/usr/lib/python3/dist-packages/qutebrowser/browser/webkit/cache.py", line 150, in prepare
  1025.     return super().prepare(meta_data)
  1026.   File "/usr/lib/python3/dist-packages/qutebrowser/utils/log.py", line 459, in qt_message_handler
  1027.     stack = ''.join(traceback.format_stack())
  1028.  
  1029. 10:50:54 INFO     webview    networkmanager:createRequest:422 Request to ssl.google-analytics.com blocked by host blocker.
  1030. 10:50:54 INFO     webview    networkmanager:createRequest:422 Request to www.google-analytics.com blocked by host blocker.
  1031. 10:50:54 DEBUG    webview    webpage:acceptNavigationRequest:478 navigation request: url https://www.redditmedia.com/gtm/jail?cb=8CqR7FcToPI, type NavigationTypeOther, target ClickTarget.normal override None
  1032. 10:50:54 DEBUG    save       savemanager:mark_dirty:72 Marking history as dirty.
  1033. 10:50:54 WARNING  qt         Unknown module:none:0 QNetworkDiskCache::prepare() unable to open temporary file
  1034.   File "/usr/bin/qutebrowser", line 11, in <module>
  1035.     load_entry_point('qutebrowser==0.10.1', 'gui_scripts', 'qutebrowser')()
  1036.   File "/usr/lib/python3/dist-packages/qutebrowser/qutebrowser.py", line 169, in main
  1037.     return app.run(args)
  1038.   File "/usr/lib/python3/dist-packages/qutebrowser/app.py", line 113, in run
  1039.     ret = qt_mainloop()
  1040.   File "/usr/lib/python3/dist-packages/qutebrowser/app.py", line 123, in qt_mainloop
  1041.     return qApp.exec_()
  1042.   File "/usr/lib/python3/dist-packages/qutebrowser/browser/webkit/cache.py", line 150, in prepare
  1043.     return super().prepare(meta_data)
  1044.   File "/usr/lib/python3/dist-packages/qutebrowser/utils/log.py", line 459, in qt_message_handler
  1045.     stack = ''.join(traceback.format_stack())
  1046.  
  1047. 10:50:54 DEBUG    webview    webpage:acceptNavigationRequest:478 navigation request: url https://www.redditmedia.com/gtm?id=GTM-NDJTNB&cb=8CqR7FcToPI, type NavigationTypeOther, target ClickTarget.normal override None
  1048. 10:50:54 WARNING  qt         Unknown module:none:0 QNetworkDiskCache::prepare() unable to open temporary file
  1049.   File "/usr/bin/qutebrowser", line 11, in <module>
  1050.     load_entry_point('qutebrowser==0.10.1', 'gui_scripts', 'qutebrowser')()
  1051.   File "/usr/lib/python3/dist-packages/qutebrowser/qutebrowser.py", line 169, in main
  1052.     return app.run(args)
  1053.   File "/usr/lib/python3/dist-packages/qutebrowser/app.py", line 113, in run
  1054.     ret = qt_mainloop()
  1055.   File "/usr/lib/python3/dist-packages/qutebrowser/app.py", line 123, in qt_mainloop
  1056.     return qApp.exec_()
  1057.   File "/usr/lib/python3/dist-packages/qutebrowser/browser/webkit/cache.py", line 150, in prepare
  1058.     return super().prepare(meta_data)
  1059.   File "/usr/lib/python3/dist-packages/qutebrowser/utils/log.py", line 459, in qt_message_handler
  1060.     stack = ''.join(traceback.format_stack())
  1061.  
  1062. 10:50:54 DEBUG    save       savemanager:mark_dirty:72 Marking cookies as dirty.
  1063. 10:50:54 INFO     webview    networkmanager:createRequest:422 Request to www.googletagservices.com blocked by host blocker.
  1064. 10:50:54 INFO     webview    networkmanager:createRequest:422 Request to c.amazon-adsystem.com blocked by host blocker.
  1065. 10:50:55 INFO     webview    networkmanager:createRequest:422 Request to pixel.redditmedia.com blocked by host blocker.
  1066. 10:50:55 DEBUG    save       savemanager:mark_dirty:72 Marking cookies as dirty.
  1067. 10:50:55 DEBUG    save       savemanager:mark_dirty:72 Marking cookies as dirty.
  1068. 10:50:55 WARNING  qt         Unknown module:none:0 QNetworkDiskCache::prepare() unable to open temporary file
  1069.   File "/usr/bin/qutebrowser", line 11, in <module>
  1070.     load_entry_point('qutebrowser==0.10.1', 'gui_scripts', 'qutebrowser')()
  1071.   File "/usr/lib/python3/dist-packages/qutebrowser/qutebrowser.py", line 169, in main
  1072.     return app.run(args)
  1073.   File "/usr/lib/python3/dist-packages/qutebrowser/app.py", line 113, in run
  1074.     ret = qt_mainloop()
  1075.   File "/usr/lib/python3/dist-packages/qutebrowser/app.py", line 123, in qt_mainloop
  1076.     return qApp.exec_()
  1077.   File "/usr/lib/python3/dist-packages/qutebrowser/browser/webkit/cache.py", line 150, in prepare
  1078.     return super().prepare(meta_data)
  1079.   File "/usr/lib/python3/dist-packages/qutebrowser/utils/log.py", line 459, in qt_message_handler
  1080.     stack = ''.join(traceback.format_stack())
  1081.  
  1082. 10:50:55 INFO     webview    networkmanager:createRequest:422 Request to www.googletagmanager.com blocked by host blocker.
  1083. 10:50:55 WARNING  qt         Unknown module:none:0 QNetworkDiskCache::prepare() unable to open temporary file
  1084.   File "/usr/bin/qutebrowser", line 11, in <module>
  1085.     load_entry_point('qutebrowser==0.10.1', 'gui_scripts', 'qutebrowser')()
  1086.   File "/usr/lib/python3/dist-packages/qutebrowser/qutebrowser.py", line 169, in main
  1087.     return app.run(args)
  1088.   File "/usr/lib/python3/dist-packages/qutebrowser/app.py", line 113, in run
  1089.     ret = qt_mainloop()
  1090.   File "/usr/lib/python3/dist-packages/qutebrowser/app.py", line 123, in qt_mainloop
  1091.     return qApp.exec_()
  1092.   File "/usr/lib/python3/dist-packages/qutebrowser/browser/webkit/cache.py", line 150, in prepare
  1093.     return super().prepare(meta_data)
  1094.   File "/usr/lib/python3/dist-packages/qutebrowser/utils/log.py", line 459, in qt_message_handler
  1095.     stack = ''.join(traceback.format_stack())
  1096.  
  1097. 10:50:55 WARNING  qt         Unknown module:none:0 QNetworkDiskCache::prepare() unable to open temporary file
  1098.   File "/usr/bin/qutebrowser", line 11, in <module>
  1099.     load_entry_point('qutebrowser==0.10.1', 'gui_scripts', 'qutebrowser')()
  1100.   File "/usr/lib/python3/dist-packages/qutebrowser/qutebrowser.py", line 169, in main
  1101.     return app.run(args)
  1102.   File "/usr/lib/python3/dist-packages/qutebrowser/app.py", line 113, in run
  1103.     ret = qt_mainloop()
  1104.   File "/usr/lib/python3/dist-packages/qutebrowser/app.py", line 123, in qt_mainloop
  1105.     return qApp.exec_()
  1106.   File "/usr/lib/python3/dist-packages/qutebrowser/browser/webkit/cache.py", line 150, in prepare
  1107.     return super().prepare(meta_data)
  1108.   File "/usr/lib/python3/dist-packages/qutebrowser/utils/log.py", line 459, in qt_message_handler
  1109.     stack = ''.join(traceback.format_stack())
  1110.  
  1111. 10:50:55 DEBUG    misc       app:on_focus_object_changed:779 Focus object changed: <qutebrowser.browser.webkit.webview.WebView tab_id=0 url='https://www.reddit.com/r/corgi/comments/73fdn8/we_lost_gizmo_to_cancer_today_you_brightened_our/?ut…'>
  1112. 10:50:55 WARNING  qt         Unknown module:none:0 QNetworkDiskCache::prepare() unable to open temporary file
  1113.   File "/usr/bin/qutebrowser", line 11, in <module>
  1114.     load_entry_point('qutebrowser==0.10.1', 'gui_scripts', 'qutebrowser')()
  1115.   File "/usr/lib/python3/dist-packages/qutebrowser/qutebrowser.py", line 169, in main
  1116.     return app.run(args)
  1117.   File "/usr/lib/python3/dist-packages/qutebrowser/app.py", line 113, in run
  1118.     ret = qt_mainloop()
  1119.   File "/usr/lib/python3/dist-packages/qutebrowser/app.py", line 123, in qt_mainloop
  1120.     return qApp.exec_()
  1121.   File "/usr/lib/python3/dist-packages/qutebrowser/browser/webkit/cache.py", line 150, in prepare
  1122.     return super().prepare(meta_data)
  1123.   File "/usr/lib/python3/dist-packages/qutebrowser/utils/log.py", line 459, in qt_message_handler
  1124.     stack = ''.join(traceback.format_stack())
  1125.  
  1126. 10:50:55 WARNING  qt         Unknown module:none:0 QNetworkDiskCache::prepare() unable to open temporary file
  1127.   File "/usr/bin/qutebrowser", line 11, in <module>
  1128.     load_entry_point('qutebrowser==0.10.1', 'gui_scripts', 'qutebrowser')()
  1129.   File "/usr/lib/python3/dist-packages/qutebrowser/qutebrowser.py", line 169, in main
  1130.     return app.run(args)
  1131.   File "/usr/lib/python3/dist-packages/qutebrowser/app.py", line 113, in run
  1132.     ret = qt_mainloop()
  1133.   File "/usr/lib/python3/dist-packages/qutebrowser/app.py", line 123, in qt_mainloop
  1134.     return qApp.exec_()
  1135.   File "/usr/lib/python3/dist-packages/qutebrowser/browser/webkit/cache.py", line 150, in prepare
  1136.     return super().prepare(meta_data)
  1137.   File "/usr/lib/python3/dist-packages/qutebrowser/utils/log.py", line 459, in qt_message_handler
  1138.     stack = ''.join(traceback.format_stack())
  1139.  
  1140. 10:50:56 WARNING  qt         Unknown module:none:0 QNetworkDiskCache::prepare() unable to open temporary file
  1141.   File "/usr/bin/qutebrowser", line 11, in <module>
  1142.     load_entry_point('qutebrowser==0.10.1', 'gui_scripts', 'qutebrowser')()
  1143.   File "/usr/lib/python3/dist-packages/qutebrowser/qutebrowser.py", line 169, in main
  1144.     return app.run(args)
  1145.   File "/usr/lib/python3/dist-packages/qutebrowser/app.py", line 113, in run
  1146.     ret = qt_mainloop()
  1147.   File "/usr/lib/python3/dist-packages/qutebrowser/app.py", line 123, in qt_mainloop
  1148.     return qApp.exec_()
  1149.   File "/usr/lib/python3/dist-packages/qutebrowser/browser/webkit/cache.py", line 150, in prepare
  1150.     return super().prepare(meta_data)
  1151.   File "/usr/lib/python3/dist-packages/qutebrowser/utils/log.py", line 459, in qt_message_handler
  1152.     stack = ''.join(traceback.format_stack())
  1153.  
  1154. 10:50:56 WARNING  qt         Unknown module:none:0 QNetworkDiskCache::prepare() unable to open temporary file
  1155.   File "/usr/bin/qutebrowser", line 11, in <module>
  1156.     load_entry_point('qutebrowser==0.10.1', 'gui_scripts', 'qutebrowser')()
  1157.   File "/usr/lib/python3/dist-packages/qutebrowser/qutebrowser.py", line 169, in main
  1158.     return app.run(args)
  1159.   File "/usr/lib/python3/dist-packages/qutebrowser/app.py", line 113, in run
  1160.     ret = qt_mainloop()
  1161.   File "/usr/lib/python3/dist-packages/qutebrowser/app.py", line 123, in qt_mainloop
  1162.     return qApp.exec_()
  1163.   File "/usr/lib/python3/dist-packages/qutebrowser/browser/webkit/cache.py", line 150, in prepare
  1164.     return super().prepare(meta_data)
  1165.   File "/usr/lib/python3/dist-packages/qutebrowser/utils/log.py", line 459, in qt_message_handler
  1166.     stack = ''.join(traceback.format_stack())
  1167.  
  1168. 10:50:56 DEBUG    sessions   sessions:save:280 Saving session _autosave to /home/dekks/.local/share/qutebrowser/sessions/_autosave.yml...
  1169. 10:50:56 ERROR    sessions   sessions:save_autosave:307 Failed to save autosave session: Existing file /home/dekks/.local/share/qutebrowser/sessions/_autosave.yml is not writable
  1170. 10:50:56 DEBUG    webview    browsertab:_set_load_status:627 load status for <qutebrowser.browser.webkit.webkittab.WebKitTab tab_id=0 url='https://www.reddit.com/r/corgi/comments/73fdn8/we_lost_gizmo_to_cancer_today_you_brightened_our/?ut…'>: LoadStatus.success_https
  1171. 10:50:56 DEBUG    signals    signalfilter:_filter_signals:86 emitting: cur_load_status_changed('success_https') (tab 0)
  1172. 10:50:56 DEBUG    signals    signalfilter:_filter_signals:86 emitting: cur_load_finished(True) (tab 0)
  1173. 10:51:00 DEBUG    modes      modeman:_eventFilter_keypress:167 got keypress in mode KeyMode.normal - delegating to <qutebrowser.keyinput.modeparsers.NormalKeyParser>
  1174. 10:51:00 DEBUG    keyboard   basekeyparser:_debug_log:112 No special binding found for pgdown.
  1175. 10:51:00 DEBUG    keyboard   basekeyparser:_debug_log:112 Got key: 0x1000017 / text: ''
  1176. 10:51:00 DEBUG    keyboard   basekeyparser:_debug_log:112 Ignoring, no text char
  1177. 10:51:00 DEBUG    modes      modeman:_eventFilter_keypress:192 handled: False, forward-unbound-keys: auto, passthrough: False, is_non_alnum: True --> filter: False (focused: <qutebrowser.browser.webkit.webview.WebView tab_id=0 url='https://www.reddit.com/r/corgi/comments/73fdn8/we_lost_gizmo_to_cancer_today_you_brightened_our/?ut…'>)
  1178. 10:51:00 DEBUG    modes      modeman:_eventFilter_keyrelease:212 filter: False
  1179. 10:51:08 DEBUG    message    message:_log_stack:46 Stack for error message:
  1180.   File "/usr/bin/qutebrowser", line 11, in <module>
  1181.     load_entry_point('qutebrowser==0.10.1', 'gui_scripts', 'qutebrowser')()
  1182.   File "/usr/lib/python3/dist-packages/qutebrowser/qutebrowser.py", line 169, in main
  1183.     return app.run(args)
  1184.   File "/usr/lib/python3/dist-packages/qutebrowser/app.py", line 113, in run
  1185.     ret = qt_mainloop()
  1186.   File "/usr/lib/python3/dist-packages/qutebrowser/app.py", line 123, in qt_mainloop
  1187.     return qApp.exec_()
  1188.   File "/usr/lib/python3/dist-packages/qutebrowser/misc/savemanager.py", line 183, in autosave
  1189.     message.error("Failed to auto-save {}: {}".format(key, e))
  1190.   File "/usr/lib/python3/dist-packages/qutebrowser/utils/message.py", line 58, in error
  1191.     stack = traceback.format_stack()
  1192. 10:51:08 ERROR    message    message:error:63 Failed to auto-save history: [Errno 30] Read-only file system: '/home/dekks/.local/share/qutebrowser/history'
  1193. 10:51:08 DEBUG    misc       mainwindow:_update_overlay_geometry:267 new geometry for <qutebrowser.mainwindow.messageview.MessageView object at 0x9e93b14c>: PyQt5.QtCore.QRect(0, 713, 1021, 18)
  1194. 10:51:08 DEBUG    message    message:_log_stack:46 Stack for error message:
  1195.   File "/usr/bin/qutebrowser", line 11, in <module>
  1196.     load_entry_point('qutebrowser==0.10.1', 'gui_scripts', 'qutebrowser')()
  1197.   File "/usr/lib/python3/dist-packages/qutebrowser/qutebrowser.py", line 169, in main
  1198.     return app.run(args)
  1199.   File "/usr/lib/python3/dist-packages/qutebrowser/app.py", line 113, in run
  1200.     ret = qt_mainloop()
  1201.   File "/usr/lib/python3/dist-packages/qutebrowser/app.py", line 123, in qt_mainloop
  1202.     return qApp.exec_()
  1203.   File "/usr/lib/python3/dist-packages/qutebrowser/misc/savemanager.py", line 183, in autosave
  1204.     message.error("Failed to auto-save {}: {}".format(key, e))
  1205.   File "/usr/lib/python3/dist-packages/qutebrowser/utils/message.py", line 58, in error
  1206.     stack = traceback.format_stack()
  1207. 10:51:08 ERROR    message    message:error:63 Failed to auto-save cookies: Existing file /home/dekks/.local/share/qutebrowser/cookies is not writable
  1208. 10:51:08 DEBUG    misc       mainwindow:_update_overlay_geometry:267 new geometry for <qutebrowser.mainwindow.messageview.MessageView object at 0x9e93b14c>: PyQt5.QtCore.QRect(0, 696, 1021, 35)
  1209. 10:51:16 DEBUG    modes      modeman:_eventFilter_keypress:167 got keypress in mode KeyMode.normal - delegating to <qutebrowser.keyinput.modeparsers.NormalKeyParser>
  1210. 10:51:16 DEBUG    keyboard   basekeyparser:_debug_log:112 No special binding found for pgdown.
  1211. 10:51:16 DEBUG    keyboard   basekeyparser:_debug_log:112 Got key: 0x1000017 / text: ''
  1212. 10:51:16 DEBUG    keyboard   basekeyparser:_debug_log:112 Ignoring, no text char
  1213. 10:51:16 DEBUG    modes      modeman:_eventFilter_keypress:192 handled: False, forward-unbound-keys: auto, passthrough: False, is_non_alnum: True --> filter: False (focused: <qutebrowser.browser.webkit.webview.WebView tab_id=0 url='https://www.reddit.com/r/corgi/comments/73fdn8/we_lost_gizmo_to_cancer_today_you_brightened_our/?ut…'>)
  1214. 10:51:16 DEBUG    modes      modeman:_eventFilter_keyrelease:212 filter: False
  1215. 10:51:23 DEBUG    message    message:_log_stack:46 Stack for error message:
  1216.   File "/usr/bin/qutebrowser", line 11, in <module>
  1217.     load_entry_point('qutebrowser==0.10.1', 'gui_scripts', 'qutebrowser')()
  1218.   File "/usr/lib/python3/dist-packages/qutebrowser/qutebrowser.py", line 169, in main
  1219.     return app.run(args)
  1220.   File "/usr/lib/python3/dist-packages/qutebrowser/app.py", line 113, in run
  1221.     ret = qt_mainloop()
  1222.   File "/usr/lib/python3/dist-packages/qutebrowser/app.py", line 123, in qt_mainloop
  1223.     return qApp.exec_()
  1224.   File "/usr/lib/python3/dist-packages/qutebrowser/misc/savemanager.py", line 183, in autosave
  1225.     message.error("Failed to auto-save {}: {}".format(key, e))
  1226.   File "/usr/lib/python3/dist-packages/qutebrowser/utils/message.py", line 58, in error
  1227.     stack = traceback.format_stack()
  1228. 10:51:23 ERROR    message    message:error:63 Failed to auto-save history: [Errno 30] Read-only file system: '/home/dekks/.local/share/qutebrowser/history'
  1229. 10:51:23 DEBUG    misc       mainwindow:_update_overlay_geometry:267 new geometry for <qutebrowser.mainwindow.messageview.MessageView object at 0x9e93b14c>: PyQt5.QtCore.QRect(0, 713, 1021, 18)
  1230. 10:51:23 DEBUG    message    message:_log_stack:46 Stack for error message:
  1231.   File "/usr/bin/qutebrowser", line 11, in <module>
  1232.     load_entry_point('qutebrowser==0.10.1', 'gui_scripts', 'qutebrowser')()
  1233.   File "/usr/lib/python3/dist-packages/qutebrowser/qutebrowser.py", line 169, in main
  1234.     return app.run(args)
  1235.   File "/usr/lib/python3/dist-packages/qutebrowser/app.py", line 113, in run
  1236.     ret = qt_mainloop()
  1237.   File "/usr/lib/python3/dist-packages/qutebrowser/app.py", line 123, in qt_mainloop
  1238.     return qApp.exec_()
  1239.   File "/usr/lib/python3/dist-packages/qutebrowser/misc/savemanager.py", line 183, in autosave
  1240.     message.error("Failed to auto-save {}: {}".format(key, e))
  1241.   File "/usr/lib/python3/dist-packages/qutebrowser/utils/message.py", line 58, in error
  1242.     stack = traceback.format_stack()
  1243. 10:51:23 ERROR    message    message:error:63 Failed to auto-save cookies: Existing file /home/dekks/.local/share/qutebrowser/cookies is not writable
  1244. 10:51:23 DEBUG    misc       mainwindow:_update_overlay_geometry:267 new geometry for <qutebrowser.mainwindow.messageview.MessageView object at 0x9e93b14c>: PyQt5.QtCore.QRect(0, 696, 1021, 35)
  1245. 10:51:38 DEBUG    message    message:_log_stack:46 Stack for error message:
  1246.   File "/usr/bin/qutebrowser", line 11, in <module>
  1247.     load_entry_point('qutebrowser==0.10.1', 'gui_scripts', 'qutebrowser')()
  1248.   File "/usr/lib/python3/dist-packages/qutebrowser/qutebrowser.py", line 169, in main
  1249.     return app.run(args)
  1250.   File "/usr/lib/python3/dist-packages/qutebrowser/app.py", line 113, in run
  1251.     ret = qt_mainloop()
  1252.   File "/usr/lib/python3/dist-packages/qutebrowser/app.py", line 123, in qt_mainloop
  1253.     return qApp.exec_()
  1254.   File "/usr/lib/python3/dist-packages/qutebrowser/misc/savemanager.py", line 183, in autosave
  1255.     message.error("Failed to auto-save {}: {}".format(key, e))
  1256.   File "/usr/lib/python3/dist-packages/qutebrowser/utils/message.py", line 58, in error
  1257.     stack = traceback.format_stack()
  1258. 10:51:38 ERROR    message    message:error:63 Failed to auto-save history: [Errno 30] Read-only file system: '/home/dekks/.local/share/qutebrowser/history'
  1259. 10:51:38 DEBUG    misc       mainwindow:_update_overlay_geometry:267 new geometry for <qutebrowser.mainwindow.messageview.MessageView object at 0x9e93b14c>: PyQt5.QtCore.QRect(0, 713, 1021, 18)
  1260. 10:51:38 DEBUG    message    message:_log_stack:46 Stack for error message:
  1261.   File "/usr/bin/qutebrowser", line 11, in <module>
  1262.     load_entry_point('qutebrowser==0.10.1', 'gui_scripts', 'qutebrowser')()
  1263.   File "/usr/lib/python3/dist-packages/qutebrowser/qutebrowser.py", line 169, in main
  1264.     return app.run(args)
  1265.   File "/usr/lib/python3/dist-packages/qutebrowser/app.py", line 113, in run
  1266.     ret = qt_mainloop()
  1267.   File "/usr/lib/python3/dist-packages/qutebrowser/app.py", line 123, in qt_mainloop
  1268.     return qApp.exec_()
  1269.   File "/usr/lib/python3/dist-packages/qutebrowser/misc/savemanager.py", line 183, in autosave
  1270.     message.error("Failed to auto-save {}: {}".format(key, e))
  1271.   File "/usr/lib/python3/dist-packages/qutebrowser/utils/message.py", line 58, in error
  1272.     stack = traceback.format_stack()
  1273. 10:51:38 ERROR    message    message:error:63 Failed to auto-save cookies: Existing file /home/dekks/.local/share/qutebrowser/cookies is not writable
  1274. 10:51:38 DEBUG    misc       mainwindow:_update_overlay_geometry:267 new geometry for <qutebrowser.mainwindow.messageview.MessageView object at 0x9e93b14c>: PyQt5.QtCore.QRect(0, 696, 1021, 35)
  1275. 10:51:42 DEBUG    modes      modeman:_eventFilter_keypress:167 got keypress in mode KeyMode.normal - delegating to <qutebrowser.keyinput.modeparsers.NormalKeyParser>
  1276. 10:51:42 DEBUG    keyboard   basekeyparser:_debug_log:112 No special binding found for pgdown.
  1277. 10:51:42 DEBUG    keyboard   basekeyparser:_debug_log:112 Got key: 0x1000017 / text: ''
  1278. 10:51:42 DEBUG    keyboard   basekeyparser:_debug_log:112 Ignoring, no text char
  1279. 10:51:42 DEBUG    modes      modeman:_eventFilter_keypress:192 handled: False, forward-unbound-keys: auto, passthrough: False, is_non_alnum: True --> filter: False (focused: <qutebrowser.browser.webkit.webview.WebView tab_id=0 url='https://www.reddit.com/r/corgi/comments/73fdn8/we_lost_gizmo_to_cancer_today_you_brightened_our/?ut…'>)
  1280. 10:51:43 DEBUG    modes      modeman:_eventFilter_keyrelease:212 filter: False
  1281. 10:51:53 DEBUG    message    message:_log_stack:46 Stack for error message:
  1282.   File "/usr/bin/qutebrowser", line 11, in <module>
  1283.     load_entry_point('qutebrowser==0.10.1', 'gui_scripts', 'qutebrowser')()
  1284.   File "/usr/lib/python3/dist-packages/qutebrowser/qutebrowser.py", line 169, in main
  1285.     return app.run(args)
  1286.   File "/usr/lib/python3/dist-packages/qutebrowser/app.py", line 113, in run
  1287.     ret = qt_mainloop()
  1288.   File "/usr/lib/python3/dist-packages/qutebrowser/app.py", line 123, in qt_mainloop
  1289.     return qApp.exec_()
  1290.   File "/usr/lib/python3/dist-packages/qutebrowser/misc/savemanager.py", line 183, in autosave
  1291.     message.error("Failed to auto-save {}: {}".format(key, e))
  1292.   File "/usr/lib/python3/dist-packages/qutebrowser/utils/message.py", line 58, in error
  1293.     stack = traceback.format_stack()
  1294. 10:51:53 ERROR    message    message:error:63 Failed to auto-save history: [Errno 30] Read-only file system: '/home/dekks/.local/share/qutebrowser/history'
  1295. 10:51:53 DEBUG    misc       mainwindow:_update_overlay_geometry:267 new geometry for <qutebrowser.mainwindow.messageview.MessageView object at 0x9e93b14c>: PyQt5.QtCore.QRect(0, 713, 1021, 18)
  1296. 10:51:53 DEBUG    message    message:_log_stack:46 Stack for error message:
  1297.   File "/usr/bin/qutebrowser", line 11, in <module>
  1298.     load_entry_point('qutebrowser==0.10.1', 'gui_scripts', 'qutebrowser')()
  1299.   File "/usr/lib/python3/dist-packages/qutebrowser/qutebrowser.py", line 169, in main
  1300.     return app.run(args)
  1301.   File "/usr/lib/python3/dist-packages/qutebrowser/app.py", line 113, in run
  1302.     ret = qt_mainloop()
  1303.   File "/usr/lib/python3/dist-packages/qutebrowser/app.py", line 123, in qt_mainloop
  1304.     return qApp.exec_()
  1305.   File "/usr/lib/python3/dist-packages/qutebrowser/misc/savemanager.py", line 183, in autosave
  1306.     message.error("Failed to auto-save {}: {}".format(key, e))
  1307.   File "/usr/lib/python3/dist-packages/qutebrowser/utils/message.py", line 58, in error
  1308.     stack = traceback.format_stack()
  1309. 10:51:53 ERROR    message    message:error:63 Failed to auto-save cookies: Existing file /home/dekks/.local/share/qutebrowser/cookies is not writable
  1310. 10:51:53 DEBUG    misc       mainwindow:_update_overlay_geometry:267 new geometry for <qutebrowser.mainwindow.messageview.MessageView object at 0x9e93b14c>: PyQt5.QtCore.QRect(0, 696, 1021, 35)
  1311. 10:51:56 DEBUG    modes      modeman:_eventFilter_keypress:167 got keypress in mode KeyMode.normal - delegating to <qutebrowser.keyinput.modeparsers.NormalKeyParser>
  1312. 10:51:56 DEBUG    keyboard   basekeyparser:_debug_log:112 No special binding found for pgdown.
  1313. 10:51:56 DEBUG    keyboard   basekeyparser:_debug_log:112 Got key: 0x1000017 / text: ''
  1314. 10:51:56 DEBUG    keyboard   basekeyparser:_debug_log:112 Ignoring, no text char
  1315. 10:51:56 DEBUG    modes      modeman:_eventFilter_keypress:192 handled: False, forward-unbound-keys: auto, passthrough: False, is_non_alnum: True --> filter: False (focused: <qutebrowser.browser.webkit.webview.WebView tab_id=0 url='https://www.reddit.com/r/corgi/comments/73fdn8/we_lost_gizmo_to_cancer_today_you_brightened_our/?ut…'>)
  1316. 10:51:56 DEBUG    modes      modeman:_eventFilter_keyrelease:212 filter: False
  1317. 10:51:59 DEBUG    modes      modeman:_eventFilter_keypress:167 got keypress in mode KeyMode.normal - delegating to <qutebrowser.keyinput.modeparsers.NormalKeyParser>
  1318. 10:51:59 DEBUG    keyboard   basekeyparser:_debug_log:112 No special binding found for pgdown.
  1319. 10:51:59 DEBUG    keyboard   basekeyparser:_debug_log:112 Got key: 0x1000017 / text: ''
  1320. 10:51:59 DEBUG    keyboard   basekeyparser:_debug_log:112 Ignoring, no text char
  1321. 10:51:59 DEBUG    modes      modeman:_eventFilter_keypress:192 handled: False, forward-unbound-keys: auto, passthrough: False, is_non_alnum: True --> filter: False (focused: <qutebrowser.browser.webkit.webview.WebView tab_id=0 url='https://www.reddit.com/r/corgi/comments/73fdn8/we_lost_gizmo_to_cancer_today_you_brightened_our/?ut…'>)
  1322. 10:51:59 DEBUG    modes      modeman:_eventFilter_keyrelease:212 filter: False
  1323. 10:52:00 DEBUG    modes      modeman:_eventFilter_keypress:167 got keypress in mode KeyMode.normal - delegating to <qutebrowser.keyinput.modeparsers.NormalKeyParser>
  1324. 10:52:00 DEBUG    keyboard   basekeyparser:_debug_log:112 No special binding found for pgdown.
  1325. 10:52:00 DEBUG    keyboard   basekeyparser:_debug_log:112 Got key: 0x1000017 / text: ''
  1326. 10:52:00 DEBUG    keyboard   basekeyparser:_debug_log:112 Ignoring, no text char
  1327. 10:52:00 DEBUG    modes      modeman:_eventFilter_keypress:192 handled: False, forward-unbound-keys: auto, passthrough: False, is_non_alnum: True --> filter: False (focused: <qutebrowser.browser.webkit.webview.WebView tab_id=0 url='https://www.reddit.com/r/corgi/comments/73fdn8/we_lost_gizmo_to_cancer_today_you_brightened_our/?ut…'>)
  1328. 10:52:00 DEBUG    modes      modeman:_eventFilter_keyrelease:212 filter: False
  1329. 10:52:00 DEBUG    modes      modeman:_eventFilter_keypress:167 got keypress in mode KeyMode.normal - delegating to <qutebrowser.keyinput.modeparsers.NormalKeyParser>
  1330. 10:52:00 DEBUG    keyboard   basekeyparser:_debug_log:112 No special binding found for pgdown.
  1331. 10:52:00 DEBUG    keyboard   basekeyparser:_debug_log:112 Got key: 0x1000017 / text: ''
  1332. 10:52:00 DEBUG    keyboard   basekeyparser:_debug_log:112 Ignoring, no text char
  1333. 10:52:00 DEBUG    modes      modeman:_eventFilter_keypress:192 handled: False, forward-unbound-keys: auto, passthrough: False, is_non_alnum: True --> filter: False (focused: <qutebrowser.browser.webkit.webview.WebView tab_id=0 url='https://www.reddit.com/r/corgi/comments/73fdn8/we_lost_gizmo_to_cancer_today_you_brightened_our/?ut…'>)
  1334. 10:52:00 DEBUG    modes      modeman:_eventFilter_keyrelease:212 filter: False
  1335. 10:52:01 DEBUG    modes      modeman:_eventFilter_keypress:167 got keypress in mode KeyMode.normal - delegating to <qutebrowser.keyinput.modeparsers.NormalKeyParser>
  1336. 10:52:01 DEBUG    keyboard   basekeyparser:_debug_log:112 No special binding found for pgup.
  1337. 10:52:01 DEBUG    keyboard   basekeyparser:_debug_log:112 Got key: 0x1000016 / text: ''
  1338. 10:52:01 DEBUG    keyboard   basekeyparser:_debug_log:112 Ignoring, no text char
  1339. 10:52:01 DEBUG    modes      modeman:_eventFilter_keypress:192 handled: False, forward-unbound-keys: auto, passthrough: False, is_non_alnum: True --> filter: False (focused: <qutebrowser.browser.webkit.webview.WebView tab_id=0 url='https://www.reddit.com/r/corgi/comments/73fdn8/we_lost_gizmo_to_cancer_today_you_brightened_our/?ut…'>)
  1340. 10:52:01 DEBUG    modes      modeman:_eventFilter_keyrelease:212 filter: False
  1341. 10:52:01 DEBUG    modes      modeman:_eventFilter_keypress:167 got keypress in mode KeyMode.normal - delegating to <qutebrowser.keyinput.modeparsers.NormalKeyParser>
  1342. 10:52:01 DEBUG    keyboard   basekeyparser:_debug_log:112 No special binding found for pgup.
  1343. 10:52:01 DEBUG    keyboard   basekeyparser:_debug_log:112 Got key: 0x1000016 / text: ''
  1344. 10:52:01 DEBUG    keyboard   basekeyparser:_debug_log:112 Ignoring, no text char
  1345. 10:52:01 DEBUG    modes      modeman:_eventFilter_keypress:192 handled: False, forward-unbound-keys: auto, passthrough: False, is_non_alnum: True --> filter: False (focused: <qutebrowser.browser.webkit.webview.WebView tab_id=0 url='https://www.reddit.com/r/corgi/comments/73fdn8/we_lost_gizmo_to_cancer_today_you_brightened_our/?ut…'>)
  1346. 10:52:01 DEBUG    modes      modeman:_eventFilter_keyrelease:212 filter: False
  1347. 10:52:01 DEBUG    modes      modeman:_eventFilter_keypress:167 got keypress in mode KeyMode.normal - delegating to <qutebrowser.keyinput.modeparsers.NormalKeyParser>
  1348. 10:52:01 DEBUG    keyboard   basekeyparser:_debug_log:112 No special binding found for pgup.
  1349. 10:52:01 DEBUG    keyboard   basekeyparser:_debug_log:112 Got key: 0x1000016 / text: ''
  1350. 10:52:01 DEBUG    keyboard   basekeyparser:_debug_log:112 Ignoring, no text char
  1351. 10:52:01 DEBUG    modes      modeman:_eventFilter_keypress:192 handled: False, forward-unbound-keys: auto, passthrough: False, is_non_alnum: True --> filter: False (focused: <qutebrowser.browser.webkit.webview.WebView tab_id=0 url='https://www.reddit.com/r/corgi/comments/73fdn8/we_lost_gizmo_to_cancer_today_you_brightened_our/?ut…'>)
  1352. 10:52:02 DEBUG    modes      modeman:_eventFilter_keyrelease:212 filter: False
  1353. 10:52:02 DEBUG    modes      modeman:_eventFilter_keypress:167 got keypress in mode KeyMode.normal - delegating to <qutebrowser.keyinput.modeparsers.NormalKeyParser>
  1354. 10:52:02 DEBUG    keyboard   basekeyparser:_debug_log:112 No special binding found for pgup.
  1355. 10:52:02 DEBUG    keyboard   basekeyparser:_debug_log:112 Got key: 0x1000016 / text: ''
  1356. 10:52:02 DEBUG    keyboard   basekeyparser:_debug_log:112 Ignoring, no text char
  1357. 10:52:02 DEBUG    modes      modeman:_eventFilter_keypress:192 handled: False, forward-unbound-keys: auto, passthrough: False, is_non_alnum: True --> filter: False (focused: <qutebrowser.browser.webkit.webview.WebView tab_id=0 url='https://www.reddit.com/r/corgi/comments/73fdn8/we_lost_gizmo_to_cancer_today_you_brightened_our/?ut…'>)
  1358. 10:52:02 DEBUG    modes      modeman:_eventFilter_keyrelease:212 filter: False
  1359. 10:52:02 DEBUG    modes      modeman:_eventFilter_keypress:167 got keypress in mode KeyMode.normal - delegating to <qutebrowser.keyinput.modeparsers.NormalKeyParser>
  1360. 10:52:02 DEBUG    keyboard   basekeyparser:_debug_log:112 No special binding found for pgup.
  1361. 10:52:02 DEBUG    keyboard   basekeyparser:_debug_log:112 Got key: 0x1000016 / text: ''
  1362. 10:52:02 DEBUG    keyboard   basekeyparser:_debug_log:112 Ignoring, no text char
  1363. 10:52:02 DEBUG    modes      modeman:_eventFilter_keypress:192 handled: False, forward-unbound-keys: auto, passthrough: False, is_non_alnum: True --> filter: False (focused: <qutebrowser.browser.webkit.webview.WebView tab_id=0 url='https://www.reddit.com/r/corgi/comments/73fdn8/we_lost_gizmo_to_cancer_today_you_brightened_our/?ut…'>)
  1364. 10:52:02 DEBUG    modes      modeman:_eventFilter_keyrelease:212 filter: False
  1365. 10:52:02 DEBUG    modes      modeman:_eventFilter_keypress:167 got keypress in mode KeyMode.normal - delegating to <qutebrowser.keyinput.modeparsers.NormalKeyParser>
  1366. 10:52:02 DEBUG    keyboard   basekeyparser:_debug_log:112 No special binding found for pgup.
  1367. 10:52:02 DEBUG    keyboard   basekeyparser:_debug_log:112 Got key: 0x1000016 / text: ''
  1368. 10:52:02 DEBUG    keyboard   basekeyparser:_debug_log:112 Ignoring, no text char
  1369. 10:52:02 DEBUG    modes      modeman:_eventFilter_keypress:192 handled: False, forward-unbound-keys: auto, passthrough: False, is_non_alnum: True --> filter: False (focused: <qutebrowser.browser.webkit.webview.WebView tab_id=0 url='https://www.reddit.com/r/corgi/comments/73fdn8/we_lost_gizmo_to_cancer_today_you_brightened_our/?ut…'>)
  1370. 10:52:02 DEBUG    modes      modeman:_eventFilter_keyrelease:212 filter: False
  1371. 10:52:02 DEBUG    modes      modeman:_eventFilter_keypress:167 got keypress in mode KeyMode.normal - delegating to <qutebrowser.keyinput.modeparsers.NormalKeyParser>
  1372. 10:52:02 DEBUG    keyboard   basekeyparser:_debug_log:112 No special binding found for pgup.
  1373. 10:52:02 DEBUG    keyboard   basekeyparser:_debug_log:112 Got key: 0x1000016 / text: ''
  1374. 10:52:02 DEBUG    keyboard   basekeyparser:_debug_log:112 Ignoring, no text char
  1375. 10:52:02 DEBUG    modes      modeman:_eventFilter_keypress:192 handled: False, forward-unbound-keys: auto, passthrough: False, is_non_alnum: True --> filter: False (focused: <qutebrowser.browser.webkit.webview.WebView tab_id=0 url='https://www.reddit.com/r/corgi/comments/73fdn8/we_lost_gizmo_to_cancer_today_you_brightened_our/?ut…'>)
  1376. 10:52:03 DEBUG    modes      modeman:_eventFilter_keyrelease:212 filter: False
  1377. 10:52:06 DEBUG    modes      modeman:_eventFilter_keypress:167 got keypress in mode KeyMode.normal - delegating to <qutebrowser.keyinput.modeparsers.NormalKeyParser>
  1378. 10:52:06 DEBUG    keyboard   basekeyparser:_debug_log:112 Ignoring only-modifier keyeevent.
  1379. 10:52:06 DEBUG    keyboard   basekeyparser:_debug_log:112 Got key: 0x1000023 / text: ''
  1380. 10:52:06 DEBUG    keyboard   basekeyparser:_debug_log:112 Ignoring, no text char
  1381. 10:52:06 DEBUG    modes      modeman:_eventFilter_keypress:192 handled: False, forward-unbound-keys: auto, passthrough: False, is_non_alnum: True --> filter: False (focused: <qutebrowser.browser.webkit.webview.WebView tab_id=0 url='https://www.reddit.com/r/corgi/comments/73fdn8/we_lost_gizmo_to_cancer_today_you_brightened_our/?ut…'>)
  1382. 10:52:06 DEBUG    misc       app:on_focus_object_changed:779 Focus object changed: None
  1383. 10:52:08 DEBUG    message    message:_log_stack:46 Stack for error message:
  1384.   File "/usr/bin/qutebrowser", line 11, in <module>
  1385.     load_entry_point('qutebrowser==0.10.1', 'gui_scripts', 'qutebrowser')()
  1386.   File "/usr/lib/python3/dist-packages/qutebrowser/qutebrowser.py", line 169, in main
  1387.     return app.run(args)
  1388.   File "/usr/lib/python3/dist-packages/qutebrowser/app.py", line 113, in run
  1389.     ret = qt_mainloop()
  1390.   File "/usr/lib/python3/dist-packages/qutebrowser/app.py", line 123, in qt_mainloop
  1391.     return qApp.exec_()
  1392.   File "/usr/lib/python3/dist-packages/qutebrowser/misc/savemanager.py", line 183, in autosave
  1393.     message.error("Failed to auto-save {}: {}".format(key, e))
  1394.   File "/usr/lib/python3/dist-packages/qutebrowser/utils/message.py", line 58, in error
  1395.     stack = traceback.format_stack()
  1396. 10:52:08 ERROR    message    message:error:63 Failed to auto-save history: [Errno 30] Read-only file system: '/home/dekks/.local/share/qutebrowser/history'
  1397. 10:52:08 DEBUG    misc       mainwindow:_update_overlay_geometry:267 new geometry for <qutebrowser.mainwindow.messageview.MessageView object at 0x9e93b14c>: PyQt5.QtCore.QRect(0, 713, 1021, 18)
  1398. 10:52:08 DEBUG    message    message:_log_stack:46 Stack for error message:
  1399.   File "/usr/bin/qutebrowser", line 11, in <module>
  1400.     load_entry_point('qutebrowser==0.10.1', 'gui_scripts', 'qutebrowser')()
  1401.   File "/usr/lib/python3/dist-packages/qutebrowser/qutebrowser.py", line 169, in main
  1402.     return app.run(args)
  1403.   File "/usr/lib/python3/dist-packages/qutebrowser/app.py", line 113, in run
  1404.     ret = qt_mainloop()
  1405.   File "/usr/lib/python3/dist-packages/qutebrowser/app.py", line 123, in qt_mainloop
  1406.     return qApp.exec_()
  1407.   File "/usr/lib/python3/dist-packages/qutebrowser/misc/savemanager.py", line 183, in autosave
  1408.     message.error("Failed to auto-save {}: {}".format(key, e))
  1409.   File "/usr/lib/python3/dist-packages/qutebrowser/utils/message.py", line 58, in error
  1410.     stack = traceback.format_stack()
  1411. 10:52:08 ERROR    message    message:error:63 Failed to auto-save cookies: Existing file /home/dekks/.local/share/qutebrowser/cookies is not writable
  1412. 10:52:08 DEBUG    misc       mainwindow:_update_overlay_geometry:267 new geometry for <qutebrowser.mainwindow.messageview.MessageView object at 0x9e93b14c>: PyQt5.QtCore.QRect(0, 696, 1021, 35)
  1413. 10:52:23 DEBUG    message    message:_log_stack:46 Stack for error message:
  1414.   File "/usr/bin/qutebrowser", line 11, in <module>
  1415.     load_entry_point('qutebrowser==0.10.1', 'gui_scripts', 'qutebrowser')()
  1416.   File "/usr/lib/python3/dist-packages/qutebrowser/qutebrowser.py", line 169, in main
  1417.     return app.run(args)
  1418.   File "/usr/lib/python3/dist-packages/qutebrowser/app.py", line 113, in run
  1419.     ret = qt_mainloop()
  1420.   File "/usr/lib/python3/dist-packages/qutebrowser/app.py", line 123, in qt_mainloop
  1421.     return qApp.exec_()
  1422.   File "/usr/lib/python3/dist-packages/qutebrowser/misc/savemanager.py", line 183, in autosave
  1423.     message.error("Failed to auto-save {}: {}".format(key, e))
  1424.   File "/usr/lib/python3/dist-packages/qutebrowser/utils/message.py", line 58, in error
  1425.     stack = traceback.format_stack()
  1426. 10:52:23 ERROR    message    message:error:63 Failed to auto-save history: [Errno 30] Read-only file system: '/home/dekks/.local/share/qutebrowser/history'
  1427. 10:52:23 DEBUG    misc       mainwindow:_update_overlay_geometry:267 new geometry for <qutebrowser.mainwindow.messageview.MessageView object at 0x9e93b14c>: PyQt5.QtCore.QRect(0, 713, 1021, 18)
  1428. 10:52:23 DEBUG    message    message:_log_stack:46 Stack for error message:
  1429.   File "/usr/bin/qutebrowser", line 11, in <module>
  1430.     load_entry_point('qutebrowser==0.10.1', 'gui_scripts', 'qutebrowser')()
  1431.   File "/usr/lib/python3/dist-packages/qutebrowser/qutebrowser.py", line 169, in main
  1432.     return app.run(args)
  1433.   File "/usr/lib/python3/dist-packages/qutebrowser/app.py", line 113, in run
  1434.     ret = qt_mainloop()
  1435.   File "/usr/lib/python3/dist-packages/qutebrowser/app.py", line 123, in qt_mainloop
  1436.     return qApp.exec_()
  1437.   File "/usr/lib/python3/dist-packages/qutebrowser/misc/savemanager.py", line 183, in autosave
  1438.     message.error("Failed to auto-save {}: {}".format(key, e))
  1439.   File "/usr/lib/python3/dist-packages/qutebrowser/utils/message.py", line 58, in error
  1440.     stack = traceback.format_stack()
  1441. 10:52:23 ERROR    message    message:error:63 Failed to auto-save cookies: Existing file /home/dekks/.local/share/qutebrowser/cookies is not writable
  1442. 10:52:23 DEBUG    misc       mainwindow:_update_overlay_geometry:267 new geometry for <qutebrowser.mainwindow.messageview.MessageView object at 0x9e93b14c>: PyQt5.QtCore.QRect(0, 696, 1021, 35)
  1443. 10:52:38 DEBUG    message    message:_log_stack:46 Stack for error message:
  1444.   File "/usr/bin/qutebrowser", line 11, in <module>
  1445.     load_entry_point('qutebrowser==0.10.1', 'gui_scripts', 'qutebrowser')()
  1446.   File "/usr/lib/python3/dist-packages/qutebrowser/qutebrowser.py", line 169, in main
  1447.     return app.run(args)
  1448.   File "/usr/lib/python3/dist-packages/qutebrowser/app.py", line 113, in run
  1449.     ret = qt_mainloop()
  1450.   File "/usr/lib/python3/dist-packages/qutebrowser/app.py", line 123, in qt_mainloop
  1451.     return qApp.exec_()
  1452.   File "/usr/lib/python3/dist-packages/qutebrowser/misc/savemanager.py", line 183, in autosave
  1453.     message.error("Failed to auto-save {}: {}".format(key, e))
  1454.   File "/usr/lib/python3/dist-packages/qutebrowser/utils/message.py", line 58, in error
  1455.     stack = traceback.format_stack()
  1456. 10:52:38 ERROR    message    message:error:63 Failed to auto-save history: [Errno 30] Read-only file system: '/home/dekks/.local/share/qutebrowser/history'
  1457. 10:52:38 DEBUG    misc       mainwindow:_update_overlay_geometry:267 new geometry for <qutebrowser.mainwindow.messageview.MessageView object at 0x9e93b14c>: PyQt5.QtCore.QRect(0, 713, 1021, 18)
  1458. 10:52:38 DEBUG    message    message:_log_stack:46 Stack for error message:
  1459.   File "/usr/bin/qutebrowser", line 11, in <module>
  1460.     load_entry_point('qutebrowser==0.10.1', 'gui_scripts', 'qutebrowser')()
  1461.   File "/usr/lib/python3/dist-packages/qutebrowser/qutebrowser.py", line 169, in main
  1462.     return app.run(args)
  1463.   File "/usr/lib/python3/dist-packages/qutebrowser/app.py", line 113, in run
  1464.     ret = qt_mainloop()
  1465.   File "/usr/lib/python3/dist-packages/qutebrowser/app.py", line 123, in qt_mainloop
  1466.     return qApp.exec_()
  1467.   File "/usr/lib/python3/dist-packages/qutebrowser/misc/savemanager.py", line 183, in autosave
  1468.     message.error("Failed to auto-save {}: {}".format(key, e))
  1469.   File "/usr/lib/python3/dist-packages/qutebrowser/utils/message.py", line 58, in error
  1470.     stack = traceback.format_stack()
  1471. 10:52:38 ERROR    message    message:error:63 Failed to auto-save cookies: Existing file /home/dekks/.local/share/qutebrowser/cookies is not writable
  1472. 10:52:38 DEBUG    misc       mainwindow:_update_overlay_geometry:267 new geometry for <qutebrowser.mainwindow.messageview.MessageView object at 0x9e93b14c>: PyQt5.QtCore.QRect(0, 696, 1021, 35)
  1473. 10:52:53 DEBUG    message    message:_log_stack:46 Stack for error message:
  1474.   File "/usr/bin/qutebrowser", line 11, in <module>
  1475.     load_entry_point('qutebrowser==0.10.1', 'gui_scripts', 'qutebrowser')()
  1476.   File "/usr/lib/python3/dist-packages/qutebrowser/qutebrowser.py", line 169, in main
  1477.     return app.run(args)
  1478.   File "/usr/lib/python3/dist-packages/qutebrowser/app.py", line 113, in run
  1479.     ret = qt_mainloop()
  1480.   File "/usr/lib/python3/dist-packages/qutebrowser/app.py", line 123, in qt_mainloop
  1481.     return qApp.exec_()
  1482.   File "/usr/lib/python3/dist-packages/qutebrowser/misc/savemanager.py", line 183, in autosave
  1483.     message.error("Failed to auto-save {}: {}".format(key, e))
  1484.   File "/usr/lib/python3/dist-packages/qutebrowser/utils/message.py", line 58, in error
  1485.     stack = traceback.format_stack()
  1486. 10:52:53 ERROR    message    message:error:63 Failed to auto-save history: [Errno 30] Read-only file system: '/home/dekks/.local/share/qutebrowser/history'
  1487. 10:52:53 DEBUG    misc       mainwindow:_update_overlay_geometry:267 new geometry for <qutebrowser.mainwindow.messageview.MessageView object at 0x9e93b14c>: PyQt5.QtCore.QRect(0, 713, 1021, 18)
  1488. 10:52:53 DEBUG    message    message:_log_stack:46 Stack for error message:
  1489.   File "/usr/bin/qutebrowser", line 11, in <module>
  1490.     load_entry_point('qutebrowser==0.10.1', 'gui_scripts', 'qutebrowser')()
  1491.   File "/usr/lib/python3/dist-packages/qutebrowser/qutebrowser.py", line 169, in main
  1492.     return app.run(args)
  1493.   File "/usr/lib/python3/dist-packages/qutebrowser/app.py", line 113, in run
  1494.     ret = qt_mainloop()
  1495.   File "/usr/lib/python3/dist-packages/qutebrowser/app.py", line 123, in qt_mainloop
  1496.     return qApp.exec_()
  1497.   File "/usr/lib/python3/dist-packages/qutebrowser/misc/savemanager.py", line 183, in autosave
  1498.     message.error("Failed to auto-save {}: {}".format(key, e))
  1499.   File "/usr/lib/python3/dist-packages/qutebrowser/utils/message.py", line 58, in error
  1500.     stack = traceback.format_stack()
  1501. 10:52:53 ERROR    message    message:error:63 Failed to auto-save cookies: Existing file /home/dekks/.local/share/qutebrowser/cookies is not writable
  1502. 10:52:53 DEBUG    misc       mainwindow:_update_overlay_geometry:267 new geometry for <qutebrowser.mainwindow.messageview.MessageView object at 0x9e93b14c>: PyQt5.QtCore.QRect(0, 696, 1021, 35)
  1503. 10:53:08 DEBUG    message    message:_log_stack:46 Stack for error message:
  1504.   File "/usr/bin/qutebrowser", line 11, in <module>
  1505.     load_entry_point('qutebrowser==0.10.1', 'gui_scripts', 'qutebrowser')()
  1506.   File "/usr/lib/python3/dist-packages/qutebrowser/qutebrowser.py", line 169, in main
  1507.     return app.run(args)
  1508.   File "/usr/lib/python3/dist-packages/qutebrowser/app.py", line 113, in run
  1509.     ret = qt_mainloop()
  1510.   File "/usr/lib/python3/dist-packages/qutebrowser/app.py", line 123, in qt_mainloop
  1511.     return qApp.exec_()
  1512.   File "/usr/lib/python3/dist-packages/qutebrowser/misc/savemanager.py", line 183, in autosave
  1513.     message.error("Failed to auto-save {}: {}".format(key, e))
  1514.   File "/usr/lib/python3/dist-packages/qutebrowser/utils/message.py", line 58, in error
  1515.     stack = traceback.format_stack()
  1516. 10:53:08 ERROR    message    message:error:63 Failed to auto-save history: [Errno 30] Read-only file system: '/home/dekks/.local/share/qutebrowser/history'
  1517. 10:53:08 DEBUG    misc       mainwindow:_update_overlay_geometry:267 new geometry for <qutebrowser.mainwindow.messageview.MessageView object at 0x9e93b14c>: PyQt5.QtCore.QRect(0, 713, 1021, 18)
  1518. 10:53:08 DEBUG    message    message:_log_stack:46 Stack for error message:
  1519.   File "/usr/bin/qutebrowser", line 11, in <module>
  1520.     load_entry_point('qutebrowser==0.10.1', 'gui_scripts', 'qutebrowser')()
  1521.   File "/usr/lib/python3/dist-packages/qutebrowser/qutebrowser.py", line 169, in main
  1522.     return app.run(args)
  1523.   File "/usr/lib/python3/dist-packages/qutebrowser/app.py", line 113, in run
  1524.     ret = qt_mainloop()
  1525.   File "/usr/lib/python3/dist-packages/qutebrowser/app.py", line 123, in qt_mainloop
  1526.     return qApp.exec_()
  1527.   File "/usr/lib/python3/dist-packages/qutebrowser/misc/savemanager.py", line 183, in autosave
  1528.     message.error("Failed to auto-save {}: {}".format(key, e))
  1529.   File "/usr/lib/python3/dist-packages/qutebrowser/utils/message.py", line 58, in error
  1530.     stack = traceback.format_stack()
  1531. 10:53:08 ERROR    message    message:error:63 Failed to auto-save cookies: Existing file /home/dekks/.local/share/qutebrowser/cookies is not writable
  1532. 10:53:08 DEBUG    misc       mainwindow:_update_overlay_geometry:267 new geometry for <qutebrowser.mainwindow.messageview.MessageView object at 0x9e93b14c>: PyQt5.QtCore.QRect(0, 696, 1021, 35)
  1533. 10:53:23 DEBUG    message    message:_log_stack:46 Stack for error message:
  1534.   File "/usr/bin/qutebrowser", line 11, in <module>
  1535.     load_entry_point('qutebrowser==0.10.1', 'gui_scripts', 'qutebrowser')()
  1536.   File "/usr/lib/python3/dist-packages/qutebrowser/qutebrowser.py", line 169, in main
  1537.     return app.run(args)
  1538.   File "/usr/lib/python3/dist-packages/qutebrowser/app.py", line 113, in run
  1539.     ret = qt_mainloop()
  1540.   File "/usr/lib/python3/dist-packages/qutebrowser/app.py", line 123, in qt_mainloop
  1541.     return qApp.exec_()
  1542.   File "/usr/lib/python3/dist-packages/qutebrowser/misc/savemanager.py", line 183, in autosave
  1543.     message.error("Failed to auto-save {}: {}".format(key, e))
  1544.   File "/usr/lib/python3/dist-packages/qutebrowser/utils/message.py", line 58, in error
  1545.     stack = traceback.format_stack()
  1546. 10:53:23 ERROR    message    message:error:63 Failed to auto-save history: [Errno 30] Read-only file system: '/home/dekks/.local/share/qutebrowser/history'
  1547. 10:53:23 DEBUG    misc       mainwindow:_update_overlay_geometry:267 new geometry for <qutebrowser.mainwindow.messageview.MessageView object at 0x9e93b14c>: PyQt5.QtCore.QRect(0, 713, 1021, 18)
  1548. 10:53:23 DEBUG    message    message:_log_stack:46 Stack for error message:
  1549.   File "/usr/bin/qutebrowser", line 11, in <module>
  1550.     load_entry_point('qutebrowser==0.10.1', 'gui_scripts', 'qutebrowser')()
  1551.   File "/usr/lib/python3/dist-packages/qutebrowser/qutebrowser.py", line 169, in main
  1552.     return app.run(args)
  1553.   File "/usr/lib/python3/dist-packages/qutebrowser/app.py", line 113, in run
  1554.     ret = qt_mainloop()
  1555.   File "/usr/lib/python3/dist-packages/qutebrowser/app.py", line 123, in qt_mainloop
  1556.     return qApp.exec_()
  1557.   File "/usr/lib/python3/dist-packages/qutebrowser/misc/savemanager.py", line 183, in autosave
  1558.     message.error("Failed to auto-save {}: {}".format(key, e))
  1559.   File "/usr/lib/python3/dist-packages/qutebrowser/utils/message.py", line 58, in error
  1560.     stack = traceback.format_stack()
  1561. 10:53:23 ERROR    message    message:error:63 Failed to auto-save cookies: Existing file /home/dekks/.local/share/qutebrowser/cookies is not writable
  1562. 10:53:23 DEBUG    misc       mainwindow:_update_overlay_geometry:267 new geometry for <qutebrowser.mainwindow.messageview.MessageView object at 0x9e93b14c>: PyQt5.QtCore.QRect(0, 696, 1021, 35)
  1563. 10:53:38 DEBUG    message    message:_log_stack:46 Stack for error message:
  1564.   File "/usr/bin/qutebrowser", line 11, in <module>
  1565.     load_entry_point('qutebrowser==0.10.1', 'gui_scripts', 'qutebrowser')()
  1566.   File "/usr/lib/python3/dist-packages/qutebrowser/qutebrowser.py", line 169, in main
  1567.     return app.run(args)
  1568.   File "/usr/lib/python3/dist-packages/qutebrowser/app.py", line 113, in run
  1569.     ret = qt_mainloop()
  1570.   File "/usr/lib/python3/dist-packages/qutebrowser/app.py", line 123, in qt_mainloop
  1571.     return qApp.exec_()
  1572.   File "/usr/lib/python3/dist-packages/qutebrowser/misc/savemanager.py", line 183, in autosave
  1573.     message.error("Failed to auto-save {}: {}".format(key, e))
  1574.   File "/usr/lib/python3/dist-packages/qutebrowser/utils/message.py", line 58, in error
  1575.     stack = traceback.format_stack()
  1576. 10:53:38 ERROR    message    message:error:63 Failed to auto-save history: [Errno 30] Read-only file system: '/home/dekks/.local/share/qutebrowser/history'
  1577. 10:53:38 DEBUG    misc       mainwindow:_update_overlay_geometry:267 new geometry for <qutebrowser.mainwindow.messageview.MessageView object at 0x9e93b14c>: PyQt5.QtCore.QRect(0, 713, 1021, 18)
  1578. 10:53:38 DEBUG    message    message:_log_stack:46 Stack for error message:
  1579.   File "/usr/bin/qutebrowser", line 11, in <module>
  1580.     load_entry_point('qutebrowser==0.10.1', 'gui_scripts', 'qutebrowser')()
  1581.   File "/usr/lib/python3/dist-packages/qutebrowser/qutebrowser.py", line 169, in main
  1582.     return app.run(args)
  1583.   File "/usr/lib/python3/dist-packages/qutebrowser/app.py", line 113, in run
  1584.     ret = qt_mainloop()
  1585.   File "/usr/lib/python3/dist-packages/qutebrowser/app.py", line 123, in qt_mainloop
  1586.     return qApp.exec_()
  1587.   File "/usr/lib/python3/dist-packages/qutebrowser/misc/savemanager.py", line 183, in autosave
  1588.     message.error("Failed to auto-save {}: {}".format(key, e))
  1589.   File "/usr/lib/python3/dist-packages/qutebrowser/utils/message.py", line 58, in error
  1590.     stack = traceback.format_stack()
  1591. 10:53:38 ERROR    message    message:error:63 Failed to auto-save cookies: Existing file /home/dekks/.local/share/qutebrowser/cookies is not writable
  1592. 10:53:38 DEBUG    misc       mainwindow:_update_overlay_geometry:267 new geometry for <qutebrowser.mainwindow.messageview.MessageView object at 0x9e93b14c>: PyQt5.QtCore.QRect(0, 696, 1021, 35)
  1593. 10:53:53 DEBUG    message    message:_log_stack:46 Stack for error message:
  1594.   File "/usr/bin/qutebrowser", line 11, in <module>
  1595.     load_entry_point('qutebrowser==0.10.1', 'gui_scripts', 'qutebrowser')()
  1596.   File "/usr/lib/python3/dist-packages/qutebrowser/qutebrowser.py", line 169, in main
  1597.     return app.run(args)
  1598.   File "/usr/lib/python3/dist-packages/qutebrowser/app.py", line 113, in run
  1599.     ret = qt_mainloop()
  1600.   File "/usr/lib/python3/dist-packages/qutebrowser/app.py", line 123, in qt_mainloop
  1601.     return qApp.exec_()
  1602.   File "/usr/lib/python3/dist-packages/qutebrowser/misc/savemanager.py", line 183, in autosave
  1603.     message.error("Failed to auto-save {}: {}".format(key, e))
  1604.   File "/usr/lib/python3/dist-packages/qutebrowser/utils/message.py", line 58, in error
  1605.     stack = traceback.format_stack()
  1606. 10:53:53 ERROR    message    message:error:63 Failed to auto-save history: [Errno 30] Read-only file system: '/home/dekks/.local/share/qutebrowser/history'
  1607. 10:53:53 DEBUG    misc       mainwindow:_update_overlay_geometry:267 new geometry for <qutebrowser.mainwindow.messageview.MessageView object at 0x9e93b14c>: PyQt5.QtCore.QRect(0, 713, 1021, 18)
  1608. 10:53:53 DEBUG    message    message:_log_stack:46 Stack for error message:
  1609.   File "/usr/bin/qutebrowser", line 11, in <module>
  1610.     load_entry_point('qutebrowser==0.10.1', 'gui_scripts', 'qutebrowser')()
  1611.   File "/usr/lib/python3/dist-packages/qutebrowser/qutebrowser.py", line 169, in main
  1612.     return app.run(args)
  1613.   File "/usr/lib/python3/dist-packages/qutebrowser/app.py", line 113, in run
  1614.     ret = qt_mainloop()
  1615.   File "/usr/lib/python3/dist-packages/qutebrowser/app.py", line 123, in qt_mainloop
  1616.     return qApp.exec_()
  1617.   File "/usr/lib/python3/dist-packages/qutebrowser/misc/savemanager.py", line 183, in autosave
  1618.     message.error("Failed to auto-save {}: {}".format(key, e))
  1619.   File "/usr/lib/python3/dist-packages/qutebrowser/utils/message.py", line 58, in error
  1620.     stack = traceback.format_stack()
  1621. 10:53:53 ERROR    message    message:error:63 Failed to auto-save cookies: Existing file /home/dekks/.local/share/qutebrowser/cookies is not writable
  1622. 10:53:53 DEBUG    misc       mainwindow:_update_overlay_geometry:267 new geometry for <qutebrowser.mainwindow.messageview.MessageView object at 0x9e93b14c>: PyQt5.QtCore.QRect(0, 696, 1021, 35)
  1623. 10:54:08 DEBUG    message    message:_log_stack:46 Stack for error message:
  1624.   File "/usr/bin/qutebrowser", line 11, in <module>
  1625.     load_entry_point('qutebrowser==0.10.1', 'gui_scripts', 'qutebrowser')()
  1626.   File "/usr/lib/python3/dist-packages/qutebrowser/qutebrowser.py", line 169, in main
  1627.     return app.run(args)
  1628.   File "/usr/lib/python3/dist-packages/qutebrowser/app.py", line 113, in run
  1629.     ret = qt_mainloop()
  1630.   File "/usr/lib/python3/dist-packages/qutebrowser/app.py", line 123, in qt_mainloop
  1631.     return qApp.exec_()
  1632.   File "/usr/lib/python3/dist-packages/qutebrowser/misc/savemanager.py", line 183, in autosave
  1633.     message.error("Failed to auto-save {}: {}".format(key, e))
  1634.   File "/usr/lib/python3/dist-packages/qutebrowser/utils/message.py", line 58, in error
  1635.     stack = traceback.format_stack()
  1636. 10:54:08 ERROR    message    message:error:63 Failed to auto-save history: [Errno 30] Read-only file system: '/home/dekks/.local/share/qutebrowser/history'
  1637. 10:54:08 DEBUG    misc       mainwindow:_update_overlay_geometry:267 new geometry for <qutebrowser.mainwindow.messageview.MessageView object at 0x9e93b14c>: PyQt5.QtCore.QRect(0, 713, 1021, 18)
  1638. 10:54:08 DEBUG    message    message:_log_stack:46 Stack for error message:
  1639.   File "/usr/bin/qutebrowser", line 11, in <module>
  1640.     load_entry_point('qutebrowser==0.10.1', 'gui_scripts', 'qutebrowser')()
  1641.   File "/usr/lib/python3/dist-packages/qutebrowser/qutebrowser.py", line 169, in main
  1642.     return app.run(args)
  1643.   File "/usr/lib/python3/dist-packages/qutebrowser/app.py", line 113, in run
  1644.     ret = qt_mainloop()
  1645.   File "/usr/lib/python3/dist-packages/qutebrowser/app.py", line 123, in qt_mainloop
  1646.     return qApp.exec_()
  1647.   File "/usr/lib/python3/dist-packages/qutebrowser/misc/savemanager.py", line 183, in autosave
  1648.     message.error("Failed to auto-save {}: {}".format(key, e))
  1649.   File "/usr/lib/python3/dist-packages/qutebrowser/utils/message.py", line 58, in error
  1650.     stack = traceback.format_stack()
  1651. 10:54:08 ERROR    message    message:error:63 Failed to auto-save cookies: Existing file /home/dekks/.local/share/qutebrowser/cookies is not writable
  1652. 10:54:08 DEBUG    misc       mainwindow:_update_overlay_geometry:267 new geometry for <qutebrowser.mainwindow.messageview.MessageView object at 0x9e93b14c>: PyQt5.QtCore.QRect(0, 696, 1021, 35)
  1653. 10:54:23 DEBUG    message    message:_log_stack:46 Stack for error message:
  1654.   File "/usr/bin/qutebrowser", line 11, in <module>
  1655.     load_entry_point('qutebrowser==0.10.1', 'gui_scripts', 'qutebrowser')()
  1656.   File "/usr/lib/python3/dist-packages/qutebrowser/qutebrowser.py", line 169, in main
  1657.     return app.run(args)
  1658.   File "/usr/lib/python3/dist-packages/qutebrowser/app.py", line 113, in run
  1659.     ret = qt_mainloop()
  1660.   File "/usr/lib/python3/dist-packages/qutebrowser/app.py", line 123, in qt_mainloop
  1661.     return qApp.exec_()
  1662.   File "/usr/lib/python3/dist-packages/qutebrowser/misc/savemanager.py", line 183, in autosave
  1663.     message.error("Failed to auto-save {}: {}".format(key, e))
  1664.   File "/usr/lib/python3/dist-packages/qutebrowser/utils/message.py", line 58, in error
  1665.     stack = traceback.format_stack()
  1666. 10:54:23 ERROR    message    message:error:63 Failed to auto-save history: [Errno 30] Read-only file system: '/home/dekks/.local/share/qutebrowser/history'
  1667. 10:54:23 DEBUG    misc       mainwindow:_update_overlay_geometry:267 new geometry for <qutebrowser.mainwindow.messageview.MessageView object at 0x9e93b14c>: PyQt5.QtCore.QRect(0, 713, 1021, 18)
  1668. 10:54:23 DEBUG    message    message:_log_stack:46 Stack for error message:
  1669.   File "/usr/bin/qutebrowser", line 11, in <module>
  1670.     load_entry_point('qutebrowser==0.10.1', 'gui_scripts', 'qutebrowser')()
  1671.   File "/usr/lib/python3/dist-packages/qutebrowser/qutebrowser.py", line 169, in main
  1672.     return app.run(args)
  1673.   File "/usr/lib/python3/dist-packages/qutebrowser/app.py", line 113, in run
  1674.     ret = qt_mainloop()
  1675.   File "/usr/lib/python3/dist-packages/qutebrowser/app.py", line 123, in qt_mainloop
  1676.     return qApp.exec_()
  1677.   File "/usr/lib/python3/dist-packages/qutebrowser/misc/savemanager.py", line 183, in autosave
  1678.     message.error("Failed to auto-save {}: {}".format(key, e))
  1679.   File "/usr/lib/python3/dist-packages/qutebrowser/utils/message.py", line 58, in error
  1680.     stack = traceback.format_stack()
  1681. 10:54:23 ERROR    message    message:error:63 Failed to auto-save cookies: Existing file /home/dekks/.local/share/qutebrowser/cookies is not writable
  1682. 10:54:23 DEBUG    misc       mainwindow:_update_overlay_geometry:267 new geometry for <qutebrowser.mainwindow.messageview.MessageView object at 0x9e93b14c>: PyQt5.QtCore.QRect(0, 696, 1021, 35)
  1683. 10:54:38 DEBUG    message    message:_log_stack:46 Stack for error message:
  1684.   File "/usr/bin/qutebrowser", line 11, in <module>
  1685.     load_entry_point('qutebrowser==0.10.1', 'gui_scripts', 'qutebrowser')()
  1686.   File "/usr/lib/python3/dist-packages/qutebrowser/qutebrowser.py", line 169, in main
  1687.     return app.run(args)
  1688.   File "/usr/lib/python3/dist-packages/qutebrowser/app.py", line 113, in run
  1689.     ret = qt_mainloop()
  1690.   File "/usr/lib/python3/dist-packages/qutebrowser/app.py", line 123, in qt_mainloop
  1691.     return qApp.exec_()
  1692.   File "/usr/lib/python3/dist-packages/qutebrowser/misc/savemanager.py", line 183, in autosave
  1693.     message.error("Failed to auto-save {}: {}".format(key, e))
  1694.   File "/usr/lib/python3/dist-packages/qutebrowser/utils/message.py", line 58, in error
  1695.     stack = traceback.format_stack()
  1696. 10:54:38 ERROR    message    message:error:63 Failed to auto-save history: [Errno 30] Read-only file system: '/home/dekks/.local/share/qutebrowser/history'
  1697. 10:54:38 DEBUG    misc       mainwindow:_update_overlay_geometry:267 new geometry for <qutebrowser.mainwindow.messageview.MessageView object at 0x9e93b14c>: PyQt5.QtCore.QRect(0, 713, 1021, 18)
  1698. 10:54:38 DEBUG    message    message:_log_stack:46 Stack for error message:
  1699.   File "/usr/bin/qutebrowser", line 11, in <module>
  1700.     load_entry_point('qutebrowser==0.10.1', 'gui_scripts', 'qutebrowser')()
  1701.   File "/usr/lib/python3/dist-packages/qutebrowser/qutebrowser.py", line 169, in main
  1702.     return app.run(args)
  1703.   File "/usr/lib/python3/dist-packages/qutebrowser/app.py", line 113, in run
  1704.     ret = qt_mainloop()
  1705.   File "/usr/lib/python3/dist-packages/qutebrowser/app.py", line 123, in qt_mainloop
  1706.     return qApp.exec_()
  1707.   File "/usr/lib/python3/dist-packages/qutebrowser/misc/savemanager.py", line 183, in autosave
  1708.     message.error("Failed to auto-save {}: {}".format(key, e))
  1709.   File "/usr/lib/python3/dist-packages/qutebrowser/utils/message.py", line 58, in error
  1710.     stack = traceback.format_stack()
  1711. 10:54:38 ERROR    message    message:error:63 Failed to auto-save cookies: Existing file /home/dekks/.local/share/qutebrowser/cookies is not writable
  1712. 10:54:38 DEBUG    misc       mainwindow:_update_overlay_geometry:267 new geometry for <qutebrowser.mainwindow.messageview.MessageView object at 0x9e93b14c>: PyQt5.QtCore.QRect(0, 696, 1021, 35)
  1713. 10:54:53 DEBUG    message    message:_log_stack:46 Stack for error message:
  1714.   File "/usr/bin/qutebrowser", line 11, in <module>
  1715.     load_entry_point('qutebrowser==0.10.1', 'gui_scripts', 'qutebrowser')()
  1716.   File "/usr/lib/python3/dist-packages/qutebrowser/qutebrowser.py", line 169, in main
  1717.     return app.run(args)
  1718.   File "/usr/lib/python3/dist-packages/qutebrowser/app.py", line 113, in run
  1719.     ret = qt_mainloop()
  1720.   File "/usr/lib/python3/dist-packages/qutebrowser/app.py", line 123, in qt_mainloop
  1721.     return qApp.exec_()
  1722.   File "/usr/lib/python3/dist-packages/qutebrowser/misc/savemanager.py", line 183, in autosave
  1723.     message.error("Failed to auto-save {}: {}".format(key, e))
  1724.   File "/usr/lib/python3/dist-packages/qutebrowser/utils/message.py", line 58, in error
  1725.     stack = traceback.format_stack()
  1726. 10:54:53 ERROR    message    message:error:63 Failed to auto-save history: [Errno 30] Read-only file system: '/home/dekks/.local/share/qutebrowser/history'
  1727. 10:54:53 DEBUG    misc       mainwindow:_update_overlay_geometry:267 new geometry for <qutebrowser.mainwindow.messageview.MessageView object at 0x9e93b14c>: PyQt5.QtCore.QRect(0, 713, 1021, 18)
  1728. 10:54:53 DEBUG    message    message:_log_stack:46 Stack for error message:
  1729.   File "/usr/bin/qutebrowser", line 11, in <module>
  1730.     load_entry_point('qutebrowser==0.10.1', 'gui_scripts', 'qutebrowser')()
  1731.   File "/usr/lib/python3/dist-packages/qutebrowser/qutebrowser.py", line 169, in main
  1732.     return app.run(args)
  1733.   File "/usr/lib/python3/dist-packages/qutebrowser/app.py", line 113, in run
  1734.     ret = qt_mainloop()
  1735.   File "/usr/lib/python3/dist-packages/qutebrowser/app.py", line 123, in qt_mainloop
  1736.     return qApp.exec_()
  1737.   File "/usr/lib/python3/dist-packages/qutebrowser/misc/savemanager.py", line 183, in autosave
  1738.     message.error("Failed to auto-save {}: {}".format(key, e))
  1739.   File "/usr/lib/python3/dist-packages/qutebrowser/utils/message.py", line 58, in error
  1740.     stack = traceback.format_stack()
  1741. 10:54:53 ERROR    message    message:error:63 Failed to auto-save cookies: Existing file /home/dekks/.local/share/qutebrowser/cookies is not writable
  1742. 10:54:53 DEBUG    misc       mainwindow:_update_overlay_geometry:267 new geometry for <qutebrowser.mainwindow.messageview.MessageView object at 0x9e93b14c>: PyQt5.QtCore.QRect(0, 696, 1021, 35)
  1743. 10:55:08 DEBUG    message    message:_log_stack:46 Stack for error message:
  1744.   File "/usr/bin/qutebrowser", line 11, in <module>
  1745.     load_entry_point('qutebrowser==0.10.1', 'gui_scripts', 'qutebrowser')()
  1746.   File "/usr/lib/python3/dist-packages/qutebrowser/qutebrowser.py", line 169, in main
  1747.     return app.run(args)
  1748.   File "/usr/lib/python3/dist-packages/qutebrowser/app.py", line 113, in run
  1749.     ret = qt_mainloop()
  1750.   File "/usr/lib/python3/dist-packages/qutebrowser/app.py", line 123, in qt_mainloop
  1751.     return qApp.exec_()
  1752.   File "/usr/lib/python3/dist-packages/qutebrowser/misc/savemanager.py", line 183, in autosave
  1753.     message.error("Failed to auto-save {}: {}".format(key, e))
  1754.   File "/usr/lib/python3/dist-packages/qutebrowser/utils/message.py", line 58, in error
  1755.     stack = traceback.format_stack()
  1756. 10:55:08 ERROR    message    message:error:63 Failed to auto-save history: [Errno 30] Read-only file system: '/home/dekks/.local/share/qutebrowser/history'
  1757. 10:55:08 DEBUG    misc       mainwindow:_update_overlay_geometry:267 new geometry for <qutebrowser.mainwindow.messageview.MessageView object at 0x9e93b14c>: PyQt5.QtCore.QRect(0, 713, 1021, 18)
  1758. 10:55:08 DEBUG    message    message:_log_stack:46 Stack for error message:
  1759.   File "/usr/bin/qutebrowser", line 11, in <module>
  1760.     load_entry_point('qutebrowser==0.10.1', 'gui_scripts', 'qutebrowser')()
  1761.   File "/usr/lib/python3/dist-packages/qutebrowser/qutebrowser.py", line 169, in main
  1762.     return app.run(args)
  1763.   File "/usr/lib/python3/dist-packages/qutebrowser/app.py", line 113, in run
  1764.     ret = qt_mainloop()
  1765.   File "/usr/lib/python3/dist-packages/qutebrowser/app.py", line 123, in qt_mainloop
  1766.     return qApp.exec_()
  1767.   File "/usr/lib/python3/dist-packages/qutebrowser/misc/savemanager.py", line 183, in autosave
  1768.     message.error("Failed to auto-save {}: {}".format(key, e))
  1769.   File "/usr/lib/python3/dist-packages/qutebrowser/utils/message.py", line 58, in error
  1770.     stack = traceback.format_stack()
  1771. 10:55:08 ERROR    message    message:error:63 Failed to auto-save cookies: Existing file /home/dekks/.local/share/qutebrowser/cookies is not writable
  1772. 10:55:08 DEBUG    misc       mainwindow:_update_overlay_geometry:267 new geometry for <qutebrowser.mainwindow.messageview.MessageView object at 0x9e93b14c>: PyQt5.QtCore.QRect(0, 696, 1021, 35)
  1773. 10:55:23 DEBUG    message    message:_log_stack:46 Stack for error message:
  1774.   File "/usr/bin/qutebrowser", line 11, in <module>
  1775.     load_entry_point('qutebrowser==0.10.1', 'gui_scripts', 'qutebrowser')()
  1776.   File "/usr/lib/python3/dist-packages/qutebrowser/qutebrowser.py", line 169, in main
  1777.     return app.run(args)
  1778.   File "/usr/lib/python3/dist-packages/qutebrowser/app.py", line 113, in run
  1779.     ret = qt_mainloop()
  1780.   File "/usr/lib/python3/dist-packages/qutebrowser/app.py", line 123, in qt_mainloop
  1781.     return qApp.exec_()
  1782.   File "/usr/lib/python3/dist-packages/qutebrowser/misc/savemanager.py", line 183, in autosave
  1783.     message.error("Failed to auto-save {}: {}".format(key, e))
  1784.   File "/usr/lib/python3/dist-packages/qutebrowser/utils/message.py", line 58, in error
  1785.     stack = traceback.format_stack()
  1786. 10:55:23 ERROR    message    message:error:63 Failed to auto-save history: [Errno 30] Read-only file system: '/home/dekks/.local/share/qutebrowser/history'
  1787. 10:55:23 DEBUG    misc       mainwindow:_update_overlay_geometry:267 new geometry for <qutebrowser.mainwindow.messageview.MessageView object at 0x9e93b14c>: PyQt5.QtCore.QRect(0, 713, 1021, 18)
  1788. 10:55:23 DEBUG    message    message:_log_stack:46 Stack for error message:
  1789.   File "/usr/bin/qutebrowser", line 11, in <module>
  1790.     load_entry_point('qutebrowser==0.10.1', 'gui_scripts', 'qutebrowser')()
  1791.   File "/usr/lib/python3/dist-packages/qutebrowser/qutebrowser.py", line 169, in main
  1792.     return app.run(args)
  1793.   File "/usr/lib/python3/dist-packages/qutebrowser/app.py", line 113, in run
  1794.     ret = qt_mainloop()
  1795.   File "/usr/lib/python3/dist-packages/qutebrowser/app.py", line 123, in qt_mainloop
  1796.     return qApp.exec_()
  1797.   File "/usr/lib/python3/dist-packages/qutebrowser/misc/savemanager.py", line 183, in autosave
  1798.     message.error("Failed to auto-save {}: {}".format(key, e))
  1799.   File "/usr/lib/python3/dist-packages/qutebrowser/utils/message.py", line 58, in error
  1800.     stack = traceback.format_stack()
  1801. 10:55:23 ERROR    message    message:error:63 Failed to auto-save cookies: Existing file /home/dekks/.local/share/qutebrowser/cookies is not writable
  1802. 10:55:23 DEBUG    misc       mainwindow:_update_overlay_geometry:267 new geometry for <qutebrowser.mainwindow.messageview.MessageView object at 0x9e93b14c>: PyQt5.QtCore.QRect(0, 696, 1021, 35)
  1803. 10:55:38 DEBUG    message    message:_log_stack:46 Stack for error message:
  1804.   File "/usr/bin/qutebrowser", line 11, in <module>
  1805.     load_entry_point('qutebrowser==0.10.1', 'gui_scripts', 'qutebrowser')()
  1806.   File "/usr/lib/python3/dist-packages/qutebrowser/qutebrowser.py", line 169, in main
  1807.     return app.run(args)
  1808.   File "/usr/lib/python3/dist-packages/qutebrowser/app.py", line 113, in run
  1809.     ret = qt_mainloop()
  1810.   File "/usr/lib/python3/dist-packages/qutebrowser/app.py", line 123, in qt_mainloop
  1811.     return qApp.exec_()
  1812.   File "/usr/lib/python3/dist-packages/qutebrowser/misc/savemanager.py", line 183, in autosave
  1813.     message.error("Failed to auto-save {}: {}".format(key, e))
  1814.   File "/usr/lib/python3/dist-packages/qutebrowser/utils/message.py", line 58, in error
  1815.     stack = traceback.format_stack()
  1816. 10:55:38 ERROR    message    message:error:63 Failed to auto-save history: [Errno 30] Read-only file system: '/home/dekks/.local/share/qutebrowser/history'
  1817. 10:55:38 DEBUG    misc       mainwindow:_update_overlay_geometry:267 new geometry for <qutebrowser.mainwindow.messageview.MessageView object at 0x9e93b14c>: PyQt5.QtCore.QRect(0, 713, 1021, 18)
  1818. 10:55:38 DEBUG    message    message:_log_stack:46 Stack for error message:
  1819.   File "/usr/bin/qutebrowser", line 11, in <module>
  1820.     load_entry_point('qutebrowser==0.10.1', 'gui_scripts', 'qutebrowser')()
  1821.   File "/usr/lib/python3/dist-packages/qutebrowser/qutebrowser.py", line 169, in main
  1822.     return app.run(args)
  1823.   File "/usr/lib/python3/dist-packages/qutebrowser/app.py", line 113, in run
  1824.     ret = qt_mainloop()
  1825.   File "/usr/lib/python3/dist-packages/qutebrowser/app.py", line 123, in qt_mainloop
  1826.     return qApp.exec_()
  1827.   File "/usr/lib/python3/dist-packages/qutebrowser/misc/savemanager.py", line 183, in autosave
  1828.     message.error("Failed to auto-save {}: {}".format(key, e))
  1829.   File "/usr/lib/python3/dist-packages/qutebrowser/utils/message.py", line 58, in error
  1830.     stack = traceback.format_stack()
  1831. 10:55:38 ERROR    message    message:error:63 Failed to auto-save cookies: Existing file /home/dekks/.local/share/qutebrowser/cookies is not writable
  1832. 10:55:38 DEBUG    misc       mainwindow:_update_overlay_geometry:267 new geometry for <qutebrowser.mainwindow.messageview.MessageView object at 0x9e93b14c>: PyQt5.QtCore.QRect(0, 696, 1021, 35)
  1833. 10:55:53 DEBUG    message    message:_log_stack:46 Stack for error message:
  1834.   File "/usr/bin/qutebrowser", line 11, in <module>
  1835.     load_entry_point('qutebrowser==0.10.1', 'gui_scripts', 'qutebrowser')()
  1836.   File "/usr/lib/python3/dist-packages/qutebrowser/qutebrowser.py", line 169, in main
  1837.     return app.run(args)
  1838.   File "/usr/lib/python3/dist-packages/qutebrowser/app.py", line 113, in run
  1839.     ret = qt_mainloop()
  1840.   File "/usr/lib/python3/dist-packages/qutebrowser/app.py", line 123, in qt_mainloop
  1841.     return qApp.exec_()
  1842.   File "/usr/lib/python3/dist-packages/qutebrowser/misc/savemanager.py", line 183, in autosave
  1843.     message.error("Failed to auto-save {}: {}".format(key, e))
  1844.   File "/usr/lib/python3/dist-packages/qutebrowser/utils/message.py", line 58, in error
  1845.     stack = traceback.format_stack()
  1846. 10:55:53 ERROR    message    message:error:63 Failed to auto-save history: [Errno 30] Read-only file system: '/home/dekks/.local/share/qutebrowser/history'
  1847. 10:55:53 DEBUG    misc       mainwindow:_update_overlay_geometry:267 new geometry for <qutebrowser.mainwindow.messageview.MessageView object at 0x9e93b14c>: PyQt5.QtCore.QRect(0, 713, 1021, 18)
  1848. 10:55:53 DEBUG    message    message:_log_stack:46 Stack for error message:
  1849.   File "/usr/bin/qutebrowser", line 11, in <module>
  1850.     load_entry_point('qutebrowser==0.10.1', 'gui_scripts', 'qutebrowser')()
  1851.   File "/usr/lib/python3/dist-packages/qutebrowser/qutebrowser.py", line 169, in main
  1852.     return app.run(args)
  1853.   File "/usr/lib/python3/dist-packages/qutebrowser/app.py", line 113, in run
  1854.     ret = qt_mainloop()
  1855.   File "/usr/lib/python3/dist-packages/qutebrowser/app.py", line 123, in qt_mainloop
  1856.     return qApp.exec_()
  1857.   File "/usr/lib/python3/dist-packages/qutebrowser/misc/savemanager.py", line 183, in autosave
  1858.     message.error("Failed to auto-save {}: {}".format(key, e))
  1859.   File "/usr/lib/python3/dist-packages/qutebrowser/utils/message.py", line 58, in error
  1860.     stack = traceback.format_stack()
  1861. 10:55:53 ERROR    message    message:error:63 Failed to auto-save cookies: Existing file /home/dekks/.local/share/qutebrowser/cookies is not writable
  1862. 10:55:53 DEBUG    misc       mainwindow:_update_overlay_geometry:267 new geometry for <qutebrowser.mainwindow.messageview.MessageView object at 0x9e93b14c>: PyQt5.QtCore.QRect(0, 696, 1021, 35)
  1863. 10:56:08 DEBUG    message    message:_log_stack:46 Stack for error message:
  1864.   File "/usr/bin/qutebrowser", line 11, in <module>
  1865.     load_entry_point('qutebrowser==0.10.1', 'gui_scripts', 'qutebrowser')()
  1866.   File "/usr/lib/python3/dist-packages/qutebrowser/qutebrowser.py", line 169, in main
  1867.     return app.run(args)
  1868.   File "/usr/lib/python3/dist-packages/qutebrowser/app.py", line 113, in run
  1869.     ret = qt_mainloop()
  1870.   File "/usr/lib/python3/dist-packages/qutebrowser/app.py", line 123, in qt_mainloop
  1871.     return qApp.exec_()
  1872.   File "/usr/lib/python3/dist-packages/qutebrowser/misc/savemanager.py", line 183, in autosave
  1873.     message.error("Failed to auto-save {}: {}".format(key, e))
  1874.   File "/usr/lib/python3/dist-packages/qutebrowser/utils/message.py", line 58, in error
  1875.     stack = traceback.format_stack()
  1876. 10:56:08 ERROR    message    message:error:63 Failed to auto-save history: [Errno 30] Read-only file system: '/home/dekks/.local/share/qutebrowser/history'
  1877. 10:56:08 DEBUG    misc       mainwindow:_update_overlay_geometry:267 new geometry for <qutebrowser.mainwindow.messageview.MessageView object at 0x9e93b14c>: PyQt5.QtCore.QRect(0, 713, 1021, 18)
  1878. 10:56:08 DEBUG    message    message:_log_stack:46 Stack for error message:
  1879.   File "/usr/bin/qutebrowser", line 11, in <module>
  1880.     load_entry_point('qutebrowser==0.10.1', 'gui_scripts', 'qutebrowser')()
  1881.   File "/usr/lib/python3/dist-packages/qutebrowser/qutebrowser.py", line 169, in main
  1882.     return app.run(args)
  1883.   File "/usr/lib/python3/dist-packages/qutebrowser/app.py", line 113, in run
  1884.     ret = qt_mainloop()
  1885.   File "/usr/lib/python3/dist-packages/qutebrowser/app.py", line 123, in qt_mainloop
  1886.     return qApp.exec_()
  1887.   File "/usr/lib/python3/dist-packages/qutebrowser/misc/savemanager.py", line 183, in autosave
  1888.     message.error("Failed to auto-save {}: {}".format(key, e))
  1889.   File "/usr/lib/python3/dist-packages/qutebrowser/utils/message.py", line 58, in error
  1890.     stack = traceback.format_stack()
  1891. 10:56:08 ERROR    message    message:error:63 Failed to auto-save cookies: Existing file /home/dekks/.local/share/qutebrowser/cookies is not writable
  1892. 10:56:08 DEBUG    misc       mainwindow:_update_overlay_geometry:267 new geometry for <qutebrowser.mainwindow.messageview.MessageView object at 0x9e93b14c>: PyQt5.QtCore.QRect(0, 696, 1021, 35)
  1893. 10:56:23 DEBUG    message    message:_log_stack:46 Stack for error message:
  1894.   File "/usr/bin/qutebrowser", line 11, in <module>
  1895.     load_entry_point('qutebrowser==0.10.1', 'gui_scripts', 'qutebrowser')()
  1896.   File "/usr/lib/python3/dist-packages/qutebrowser/qutebrowser.py", line 169, in main
  1897.     return app.run(args)
  1898.   File "/usr/lib/python3/dist-packages/qutebrowser/app.py", line 113, in run
  1899.     ret = qt_mainloop()
  1900.   File "/usr/lib/python3/dist-packages/qutebrowser/app.py", line 123, in qt_mainloop
  1901.     return qApp.exec_()
  1902.   File "/usr/lib/python3/dist-packages/qutebrowser/misc/savemanager.py", line 183, in autosave
  1903.     message.error("Failed to auto-save {}: {}".format(key, e))
  1904.   File "/usr/lib/python3/dist-packages/qutebrowser/utils/message.py", line 58, in error
  1905.     stack = traceback.format_stack()
  1906. 10:56:23 ERROR    message    message:error:63 Failed to auto-save history: [Errno 30] Read-only file system: '/home/dekks/.local/share/qutebrowser/history'
  1907. 10:56:23 DEBUG    misc       mainwindow:_update_overlay_geometry:267 new geometry for <qutebrowser.mainwindow.messageview.MessageView object at 0x9e93b14c>: PyQt5.QtCore.QRect(0, 713, 1021, 18)
  1908. 10:56:23 DEBUG    message    message:_log_stack:46 Stack for error message:
  1909.   File "/usr/bin/qutebrowser", line 11, in <module>
  1910.     load_entry_point('qutebrowser==0.10.1', 'gui_scripts', 'qutebrowser')()
  1911.   File "/usr/lib/python3/dist-packages/qutebrowser/qutebrowser.py", line 169, in main
  1912.     return app.run(args)
  1913.   File "/usr/lib/python3/dist-packages/qutebrowser/app.py", line 113, in run
  1914.     ret = qt_mainloop()
  1915.   File "/usr/lib/python3/dist-packages/qutebrowser/app.py", line 123, in qt_mainloop
  1916.     return qApp.exec_()
  1917.   File "/usr/lib/python3/dist-packages/qutebrowser/misc/savemanager.py", line 183, in autosave
  1918.     message.error("Failed to auto-save {}: {}".format(key, e))
  1919.   File "/usr/lib/python3/dist-packages/qutebrowser/utils/message.py", line 58, in error
  1920.     stack = traceback.format_stack()
  1921. 10:56:23 ERROR    message    message:error:63 Failed to auto-save cookies: Existing file /home/dekks/.local/share/qutebrowser/cookies is not writable
  1922. 10:56:23 DEBUG    misc       mainwindow:_update_overlay_geometry:267 new geometry for <qutebrowser.mainwindow.messageview.MessageView object at 0x9e93b14c>: PyQt5.QtCore.QRect(0, 696, 1021, 35)
  1923. 10:56:38 DEBUG    message    message:_log_stack:46 Stack for error message:
  1924.   File "/usr/bin/qutebrowser", line 11, in <module>
  1925.     load_entry_point('qutebrowser==0.10.1', 'gui_scripts', 'qutebrowser')()
  1926.   File "/usr/lib/python3/dist-packages/qutebrowser/qutebrowser.py", line 169, in main
  1927.     return app.run(args)
  1928.   File "/usr/lib/python3/dist-packages/qutebrowser/app.py", line 113, in run
  1929.     ret = qt_mainloop()
  1930.   File "/usr/lib/python3/dist-packages/qutebrowser/app.py", line 123, in qt_mainloop
  1931.     return qApp.exec_()
  1932.   File "/usr/lib/python3/dist-packages/qutebrowser/misc/savemanager.py", line 183, in autosave
  1933.     message.error("Failed to auto-save {}: {}".format(key, e))
  1934.   File "/usr/lib/python3/dist-packages/qutebrowser/utils/message.py", line 58, in error
  1935.     stack = traceback.format_stack()
  1936. 10:56:38 ERROR    message    message:error:63 Failed to auto-save history: [Errno 30] Read-only file system: '/home/dekks/.local/share/qutebrowser/history'
  1937. 10:56:38 DEBUG    misc       mainwindow:_update_overlay_geometry:267 new geometry for <qutebrowser.mainwindow.messageview.MessageView object at 0x9e93b14c>: PyQt5.QtCore.QRect(0, 713, 1021, 18)
  1938. 10:56:38 DEBUG    message    message:_log_stack:46 Stack for error message:
  1939.   File "/usr/bin/qutebrowser", line 11, in <module>
  1940.     load_entry_point('qutebrowser==0.10.1', 'gui_scripts', 'qutebrowser')()
  1941.   File "/usr/lib/python3/dist-packages/qutebrowser/qutebrowser.py", line 169, in main
  1942.     return app.run(args)
  1943.   File "/usr/lib/python3/dist-packages/qutebrowser/app.py", line 113, in run
  1944.     ret = qt_mainloop()
  1945.   File "/usr/lib/python3/dist-packages/qutebrowser/app.py", line 123, in qt_mainloop
  1946.     return qApp.exec_()
  1947.   File "/usr/lib/python3/dist-packages/qutebrowser/misc/savemanager.py", line 183, in autosave
  1948.     message.error("Failed to auto-save {}: {}".format(key, e))
  1949.   File "/usr/lib/python3/dist-packages/qutebrowser/utils/message.py", line 58, in error
  1950.     stack = traceback.format_stack()
  1951. 10:56:38 ERROR    message    message:error:63 Failed to auto-save cookies: Existing file /home/dekks/.local/share/qutebrowser/cookies is not writable
  1952. 10:56:38 DEBUG    misc       mainwindow:_update_overlay_geometry:267 new geometry for <qutebrowser.mainwindow.messageview.MessageView object at 0x9e93b14c>: PyQt5.QtCore.QRect(0, 696, 1021, 35)
  1953. 10:56:53 DEBUG    message    message:_log_stack:46 Stack for error message:
  1954.   File "/usr/bin/qutebrowser", line 11, in <module>
  1955.     load_entry_point('qutebrowser==0.10.1', 'gui_scripts', 'qutebrowser')()
  1956.   File "/usr/lib/python3/dist-packages/qutebrowser/qutebrowser.py", line 169, in main
  1957.     return app.run(args)
  1958.   File "/usr/lib/python3/dist-packages/qutebrowser/app.py", line 113, in run
  1959.     ret = qt_mainloop()
  1960.   File "/usr/lib/python3/dist-packages/qutebrowser/app.py", line 123, in qt_mainloop
  1961.     return qApp.exec_()
  1962.   File "/usr/lib/python3/dist-packages/qutebrowser/misc/savemanager.py", line 183, in autosave
  1963.     message.error("Failed to auto-save {}: {}".format(key, e))
  1964.   File "/usr/lib/python3/dist-packages/qutebrowser/utils/message.py", line 58, in error
  1965.     stack = traceback.format_stack()
  1966. 10:56:53 ERROR    message    message:error:63 Failed to auto-save history: [Errno 30] Read-only file system: '/home/dekks/.local/share/qutebrowser/history'
  1967. 10:56:53 DEBUG    misc       mainwindow:_update_overlay_geometry:267 new geometry for <qutebrowser.mainwindow.messageview.MessageView object at 0x9e93b14c>: PyQt5.QtCore.QRect(0, 713, 1021, 18)
  1968. 10:56:53 DEBUG    message    message:_log_stack:46 Stack for error message:
  1969.   File "/usr/bin/qutebrowser", line 11, in <module>
  1970.     load_entry_point('qutebrowser==0.10.1', 'gui_scripts', 'qutebrowser')()
  1971.   File "/usr/lib/python3/dist-packages/qutebrowser/qutebrowser.py", line 169, in main
  1972.     return app.run(args)
  1973.   File "/usr/lib/python3/dist-packages/qutebrowser/app.py", line 113, in run
  1974.     ret = qt_mainloop()
  1975.   File "/usr/lib/python3/dist-packages/qutebrowser/app.py", line 123, in qt_mainloop
  1976.     return qApp.exec_()
  1977.   File "/usr/lib/python3/dist-packages/qutebrowser/misc/savemanager.py", line 183, in autosave
  1978.     message.error("Failed to auto-save {}: {}".format(key, e))
  1979.   File "/usr/lib/python3/dist-packages/qutebrowser/utils/message.py", line 58, in error
  1980.     stack = traceback.format_stack()
  1981. 10:56:53 ERROR    message    message:error:63 Failed to auto-save cookies: Existing file /home/dekks/.local/share/qutebrowser/cookies is not writable
  1982. 10:56:53 DEBUG    misc       mainwindow:_update_overlay_geometry:267 new geometry for <qutebrowser.mainwindow.messageview.MessageView object at 0x9e93b14c>: PyQt5.QtCore.QRect(0, 696, 1021, 35)
  1983. 10:57:08 DEBUG    message    message:_log_stack:46 Stack for error message:
  1984.   File "/usr/bin/qutebrowser", line 11, in <module>
  1985.     load_entry_point('qutebrowser==0.10.1', 'gui_scripts', 'qutebrowser')()
  1986.   File "/usr/lib/python3/dist-packages/qutebrowser/qutebrowser.py", line 169, in main
  1987.     return app.run(args)
  1988.   File "/usr/lib/python3/dist-packages/qutebrowser/app.py", line 113, in run
  1989.     ret = qt_mainloop()
  1990.   File "/usr/lib/python3/dist-packages/qutebrowser/app.py", line 123, in qt_mainloop
  1991.     return qApp.exec_()
  1992.   File "/usr/lib/python3/dist-packages/qutebrowser/misc/savemanager.py", line 183, in autosave
  1993.     message.error("Failed to auto-save {}: {}".format(key, e))
  1994.   File "/usr/lib/python3/dist-packages/qutebrowser/utils/message.py", line 58, in error
  1995.     stack = traceback.format_stack()
  1996. 10:57:08 ERROR    message    message:error:63 Failed to auto-save history: [Errno 30] Read-only file system: '/home/dekks/.local/share/qutebrowser/history'
  1997. 10:57:08 DEBUG    misc       mainwindow:_update_overlay_geometry:267 new geometry for <qutebrowser.mainwindow.messageview.MessageView object at 0x9e93b14c>: PyQt5.QtCore.QRect(0, 713, 1021, 18)
  1998. 10:57:08 DEBUG    message    message:_log_stack:46 Stack for error message:
  1999.   File "/usr/bin/qutebrowser", line 11, in <module>
  2000.     load_entry_point('qutebrowser==0.10.1', 'gui_scripts', 'qutebrowser')()
  2001.   File "/usr/lib/python3/dist-packages/qutebrowser/qutebrowser.py", line 169, in main
  2002.     return app.run(args)
  2003.   File "/usr/lib/python3/dist-packages/qutebrowser/app.py", line 113, in run
  2004.     ret = qt_mainloop()
  2005.   File "/usr/lib/python3/dist-packages/qutebrowser/app.py", line 123, in qt_mainloop
  2006.     return qApp.exec_()
  2007.   File "/usr/lib/python3/dist-packages/qutebrowser/misc/savemanager.py", line 183, in autosave
  2008.     message.error("Failed to auto-save {}: {}".format(key, e))
  2009.   File "/usr/lib/python3/dist-packages/qutebrowser/utils/message.py", line 58, in error
  2010.     stack = traceback.format_stack()
  2011. 10:57:08 ERROR    message    message:error:63 Failed to auto-save cookies: Existing file /home/dekks/.local/share/qutebrowser/cookies is not writable
  2012. 10:57:08 DEBUG    misc       mainwindow:_update_overlay_geometry:267 new geometry for <qutebrowser.mainwindow.messageview.MessageView object at 0x9e93b14c>: PyQt5.QtCore.QRect(0, 696, 1021, 35)
  2013. 10:57:23 DEBUG    message    message:_log_stack:46 Stack for error message:
  2014.   File "/usr/bin/qutebrowser", line 11, in <module>
  2015.     load_entry_point('qutebrowser==0.10.1', 'gui_scripts', 'qutebrowser')()
  2016.   File "/usr/lib/python3/dist-packages/qutebrowser/qutebrowser.py", line 169, in main
  2017.     return app.run(args)
  2018.   File "/usr/lib/python3/dist-packages/qutebrowser/app.py", line 113, in run
  2019.     ret = qt_mainloop()
  2020.   File "/usr/lib/python3/dist-packages/qutebrowser/app.py", line 123, in qt_mainloop
  2021.     return qApp.exec_()
  2022.   File "/usr/lib/python3/dist-packages/qutebrowser/misc/savemanager.py", line 183, in autosave
  2023.     message.error("Failed to auto-save {}: {}".format(key, e))
  2024.   File "/usr/lib/python3/dist-packages/qutebrowser/utils/message.py", line 58, in error
  2025.     stack = traceback.format_stack()
  2026. 10:57:23 ERROR    message    message:error:63 Failed to auto-save history: [Errno 30] Read-only file system: '/home/dekks/.local/share/qutebrowser/history'
  2027. 10:57:23 DEBUG    misc       mainwindow:_update_overlay_geometry:267 new geometry for <qutebrowser.mainwindow.messageview.MessageView object at 0x9e93b14c>: PyQt5.QtCore.QRect(0, 713, 1021, 18)
  2028. 10:57:23 DEBUG    message    message:_log_stack:46 Stack for error message:
  2029.   File "/usr/bin/qutebrowser", line 11, in <module>
  2030.     load_entry_point('qutebrowser==0.10.1', 'gui_scripts', 'qutebrowser')()
  2031.   File "/usr/lib/python3/dist-packages/qutebrowser/qutebrowser.py", line 169, in main
  2032.     return app.run(args)
  2033.   File "/usr/lib/python3/dist-packages/qutebrowser/app.py", line 113, in run
  2034.     ret = qt_mainloop()
  2035.   File "/usr/lib/python3/dist-packages/qutebrowser/app.py", line 123, in qt_mainloop
  2036.     return qApp.exec_()
  2037.   File "/usr/lib/python3/dist-packages/qutebrowser/misc/savemanager.py", line 183, in autosave
  2038.     message.error("Failed to auto-save {}: {}".format(key, e))
  2039.   File "/usr/lib/python3/dist-packages/qutebrowser/utils/message.py", line 58, in error
  2040.     stack = traceback.format_stack()
  2041. 10:57:23 ERROR    message    message:error:63 Failed to auto-save cookies: Existing file /home/dekks/.local/share/qutebrowser/cookies is not writable
  2042. 10:57:23 DEBUG    misc       mainwindow:_update_overlay_geometry:267 new geometry for <qutebrowser.mainwindow.messageview.MessageView object at 0x9e93b14c>: PyQt5.QtCore.QRect(0, 696, 1021, 35)
  2043. 10:57:27 DEBUG    misc       app:on_focus_object_changed:779 Focus object changed: <qutebrowser.browser.webkit.webview.WebView tab_id=0 url='https://www.reddit.com/r/corgi/comments/73fdn8/we_lost_gizmo_to_cancer_today_you_brightened_our/?ut…'>
  2044. 10:57:28 DEBUG    modes      modeman:_eventFilter_keypress:167 got keypress in mode KeyMode.normal - delegating to <qutebrowser.keyinput.modeparsers.NormalKeyParser>
  2045. 10:57:28 DEBUG    keyboard   basekeyparser:_debug_log:112 Ignoring only-modifier keyeevent.
  2046. 10:57:28 DEBUG    keyboard   basekeyparser:_debug_log:112 Got key: 0x1000023 / text: ''
  2047. 10:57:28 DEBUG    keyboard   basekeyparser:_debug_log:112 Ignoring, no text char
  2048. 10:57:28 DEBUG    modes      modeman:_eventFilter_keypress:192 handled: False, forward-unbound-keys: auto, passthrough: False, is_non_alnum: True --> filter: False (focused: <qutebrowser.browser.webkit.webview.WebView tab_id=0 url='https://www.reddit.com/r/corgi/comments/73fdn8/we_lost_gizmo_to_cancer_today_you_brightened_our/?ut…'>)
  2049. 10:57:28 DEBUG    misc       app:on_focus_object_changed:779 Focus object changed: None
  2050. 10:57:28 DEBUG    destroy    mainwindow:_do_close:519 Closing window 0
  2051. 10:57:28 DEBUG    destroy    webview:shutdown:124 Shutting down <qutebrowser.browser.webkit.webview.WebView tab_id=0 url='https://www.reddit.com/r/corgi/comments/73fdn8/we_lost_gizmo_to_cancer_today_you_brightened_our/?ut…'>.
  2052. 10:57:28 DEBUG    destroy    webview:shutdown:124 Shutting down <qutebrowser.browser.webkit.webview.WebView tab_id=1 url='https://kb.iu.edu/d/abue'>.
  2053. 10:57:28 DEBUG    destroy    app:shutdown:650 Shutting down with status 0, session None...
  2054. 10:57:28 DEBUG    prompt     prompt:shutdown:127 Shutting down with loops []
  2055. 10:57:28 DEBUG    destroy    app:_shutdown:677 Stage 2 of shutting down...
  2056. 10:57:28 DEBUG    destroy    app:_shutdown:683 Removing eventfilter...
  2057. 10:57:28 DEBUG    ipc        ipc:shutdown:402 Shutting down IPC (socket 0x8f6470)
  2058. 10:57:28 DEBUG    save       savemanager:save:97 Save of version requested - dirty False, save_on_exit True, is_exit True, force False -> True
  2059. 10:57:28 DEBUG    save       savemanager:save:97 Save of config requested - dirty False, save_on_exit False, is_exit True, force False -> False
  2060. 10:57:28 DEBUG    save       savemanager:save:97 Save of key-config requested - dirty False, save_on_exit False, is_exit True, force False -> False
  2061. 10:57:28 DEBUG    save       savemanager:save:97 Save of state-config requested - dirty False, save_on_exit True, is_exit True, force False -> True
  2062. 10:57:28 DEBUG    destroy    ini:save:72 Saving config to /home/dekks/.local/share/qutebrowser/state
  2063. 10:57:29 DEBUG    misc       app:on_focus_object_changed:779 Focus object changed: <PyQt5.QtWidgets.QPushButton object at 0x95ff441c>
  2064. 10:57:37 DEBUG    misc       app:on_focus_object_changed:779 Focus object changed: <PyQt5.QtWidgets.QWidget object at 0x95ff441c>
  2065. 10:57:37 DEBUG    save       savemanager:save:97 Save of command-history requested - dirty False, save_on_exit False, is_exit True, force False -> False
  2066. 10:57:37 DEBUG    save       savemanager:save:97 Save of history requested - dirty True, save_on_exit False, is_exit True, force False -> True
  2067. 10:57:37 DEBUG    misc       app:on_focus_object_changed:779 Focus object changed: <PyQt5.QtWidgets.QPushButton object at 0x95ff4344>
  2068. 10:57:38 DEBUG    misc       app:on_focus_object_changed:779 Focus object changed: <PyQt5.QtWidgets.QWidget object at 0x95ff4344>
  2069. 10:57:38 DEBUG    save       savemanager:save:97 Save of quickmark-manager requested - dirty False, save_on_exit False, is_exit True, force False -> False
  2070. 10:57:38 DEBUG    save       savemanager:save:97 Save of bookmark-manager requested - dirty False, save_on_exit False, is_exit True, force False -> False
  2071. 10:57:38 DEBUG    save       savemanager:save:97 Save of cookies requested - dirty True, save_on_exit False, is_exit True, force False -> True
  2072. 10:57:38 DEBUG    message    message:_log_stack:46 Stack for error message:
  2073.   File "/usr/bin/qutebrowser", line 11, in <module>
  2074.     load_entry_point('qutebrowser==0.10.1', 'gui_scripts', 'qutebrowser')()
  2075.   File "/usr/lib/python3/dist-packages/qutebrowser/qutebrowser.py", line 169, in main
  2076.     return app.run(args)
  2077.   File "/usr/lib/python3/dist-packages/qutebrowser/app.py", line 113, in run
  2078.     ret = qt_mainloop()
  2079.   File "/usr/lib/python3/dist-packages/qutebrowser/app.py", line 123, in qt_mainloop
  2080.     return qApp.exec_()
  2081.   File "/usr/lib/python3/dist-packages/qutebrowser/app.py", line 493, in on_last_window_closed
  2082.     self.shutdown(last_window=True)
  2083.   File "/usr/lib/python3/dist-packages/qutebrowser/app.py", line 673, in shutdown
  2084.     self._shutdown(status, restart=restart)
  2085.   File "/usr/lib/python3/dist-packages/qutebrowser/app.py", line 707, in _shutdown
  2086.     pre_text="Error while saving {}".format(key))
  2087.   File "/usr/lib/python3/dist-packages/qutebrowser/utils/error.py", line 69, in handle_fatal_exc
  2088.     msgbox.exec_()
  2089.   File "/usr/lib/python3/dist-packages/qutebrowser/misc/savemanager.py", line 183, in autosave
  2090.     message.error("Failed to auto-save {}: {}".format(key, e))
  2091.   File "/usr/lib/python3/dist-packages/qutebrowser/utils/message.py", line 58, in error
  2092.     stack = traceback.format_stack()
  2093. 10:57:38 ERROR    message    message:error:63 Failed to auto-save history: [Errno 30] Read-only file system: '/home/dekks/.local/share/qutebrowser/history'
  2094. 10:57:38 DEBUG    message    message:_log_stack:46 Stack for error message:
  2095.   File "/usr/bin/qutebrowser", line 11, in <module>
  2096.     load_entry_point('qutebrowser==0.10.1', 'gui_scripts', 'qutebrowser')()
  2097.   File "/usr/lib/python3/dist-packages/qutebrowser/qutebrowser.py", line 169, in main
  2098.     return app.run(args)
  2099.   File "/usr/lib/python3/dist-packages/qutebrowser/app.py", line 113, in run
  2100.     ret = qt_mainloop()
  2101.   File "/usr/lib/python3/dist-packages/qutebrowser/app.py", line 123, in qt_mainloop
  2102.     return qApp.exec_()
  2103.   File "/usr/lib/python3/dist-packages/qutebrowser/app.py", line 493, in on_last_window_closed
  2104.     self.shutdown(last_window=True)
  2105.   File "/usr/lib/python3/dist-packages/qutebrowser/app.py", line 673, in shutdown
  2106.     self._shutdown(status, restart=restart)
  2107.   File "/usr/lib/python3/dist-packages/qutebrowser/app.py", line 707, in _shutdown
  2108.     pre_text="Error while saving {}".format(key))
  2109.   File "/usr/lib/python3/dist-packages/qutebrowser/utils/error.py", line 69, in handle_fatal_exc
  2110.     msgbox.exec_()
  2111.   File "/usr/lib/python3/dist-packages/qutebrowser/misc/savemanager.py", line 183, in autosave
  2112.     message.error("Failed to auto-save {}: {}".format(key, e))
  2113.   File "/usr/lib/python3/dist-packages/qutebrowser/utils/message.py", line 58, in error
  2114.     stack = traceback.format_stack()
  2115. 10:57:38 ERROR    message    message:error:63 Failed to auto-save cookies: Existing file /home/dekks/.local/share/qutebrowser/cookies is not writable
  2116. 10:57:38 DEBUG    misc       app:on_focus_object_changed:779 Focus object changed: <PyQt5.QtWidgets.QPushButton object at 0x95ff477c>
  2117. 10:57:40 DEBUG    misc       app:on_focus_object_changed:779 Focus object changed: <PyQt5.QtWidgets.QWidget object at 0x95ff477c>
  2118. 10:57:40 DEBUG    destroy    app:_shutdown:711 Deactivating crash log...
  2119. 10:57:40 ERROR    destroy    crashsignal:destroy_crashlogfile:164 Could not remove crash log!
  2120. Traceback (most recent call last):
  2121.   File "/usr/lib/python3/dist-packages/qutebrowser/misc/crashsignal.py", line 162, in destroy_crashlogfile
  2122.     os.remove(self._crash_log_file.name)
  2123. OSError: [Errno 30] Read-only file system: '/home/dekks/.local/share/qutebrowser/crash.log'
  2124. 10:57:40 DEBUG    destroy    app:_shutdown:721 Deactivating message handler...
  2125. 10:57:40 DEBUG    destroy    app:_shutdown:724 Deferring QApplication::exit...
  2126. 10:57:40 ERROR    misc       crashsignal:exception_hook:205 Uncaught exception
  2127. Traceback (most recent call last):
  2128.   File "/usr/lib/python3/dist-packages/qutebrowser/app.py", line 493, in on_last_window_closed
  2129.     self.shutdown(last_window=True)
  2130.   File "/usr/lib/python3/dist-packages/qutebrowser/app.py", line 673, in shutdown
  2131.     self._shutdown(status, restart=restart)
  2132.   File "/usr/lib/python3/dist-packages/qutebrowser/app.py", line 726, in _shutdown
  2133.     objreg.get('session-manager').delete_autosave()
  2134.   File "/usr/lib/python3/dist-packages/qutebrowser/misc/sessions.py", line 312, in delete_autosave
  2135.     self.delete('_autosave')
  2136.   File "/usr/lib/python3/dist-packages/qutebrowser/misc/sessions.py", line 403, in delete
  2137.     os.remove(path)
  2138. OSError: [Errno 30] Read-only file system: '/home/dekks/.local/share/qutebrowser/sessions/_autosave.yml'
  2139. 10:57:40 DEBUG    misc       standarddir:_writable_location:143 writable location for ConfigLocation: /home/dekks/.config
  2140. 10:57:40 DEBUG    misc       standarddir:_writable_location:143 writable location for AppLocalDataLocation: /home/dekks/.local/share/qutebrowser
  2141. 10:57:40 DEBUG    misc       standarddir:_writable_location:143 writable location for CacheLocation: /home/dekks/.cache/qutebrowser
  2142. 10:57:40 DEBUG    misc       standarddir:_writable_location:143 writable location for DownloadLocation: /home/dekks/Downloads
  2143. 10:57:40 DEBUG    misc       standarddir:_writable_location:143 writable location for RuntimeLocation: /run/user/1000