From anonymous, 3 Months ago, written in Plain Text.
Embed
  1. cd qtwebengine/ && ( test -e Makefile || /home/florian/code/qt/qt5/qtbase/bin/qmake -o Makefile /home/florian/code/qt/qt5/qtwebengine/qtwebengine.pro ) && /usr/bin/make -f Makefile
  2. Info: creating cache file /home/florian/code/qt/qt5/qtwebengine/.qmake.cache
  3. make[1]: Entering directory '/home/florian/code/qt/qt5/qtwebengine'
  4. cd src/ && ( test -e Makefile || /home/florian/code/qt/qt5/qtbase/bin/qmake -o Makefile /home/florian/code/qt/qt5/qtwebengine/src/src.pro ) && /usr/bin/make -f Makefile
  5. make[2]: Entering directory '/home/florian/code/qt/qt5/qtwebengine/src'
  6. cd webengine/ui/ && ( test -e Makefile || /home/florian/code/qt/qt5/qtbase/bin/qmake -o Makefile /home/florian/code/qt/qt5/qtwebengine/src/webengine/ui/ui.pro ) && /usr/bin/make -f Makefile
  7. cd buildtools/ && ( test -e Makefile || /home/florian/code/qt/qt5/qtbase/bin/qmake -o Makefile /home/florian/code/qt/qt5/qtwebengine/src/buildtools/buildtools.pro ) && /usr/bin/make -f Makefile
  8. cd webengine/ui2/ && ( test -e Makefile || /home/florian/code/qt/qt5/qtbase/bin/qmake -o Makefile /home/florian/code/qt/qt5/qtwebengine/src/webengine/ui2/ui2.pro ) && /usr/bin/make -f Makefile
  9. make[3]: Entering directory '/home/florian/code/qt/qt5/qtwebengine/src/webengine/ui'
  10. make[3]: Nothing to be done for 'first'.
  11. make[3]: Leaving directory '/home/florian/code/qt/qt5/qtwebengine/src/webengine/ui'
  12. make[3]: Entering directory '/home/florian/code/qt/qt5/qtwebengine/src/buildtools'
  13. ( test -e Makefile.ninja || /home/florian/code/qt/qt5/qtbase/bin/qmake -o Makefile.ninja /home/florian/code/qt/qt5/qtwebengine/src/buildtools/ninja.pro ) && /usr/bin/make -f Makefile.ninja
  14. ( test -e Makefile.configure_host || /home/florian/code/qt/qt5/qtbase/bin/qmake -o Makefile.configure_host /home/florian/code/qt/qt5/qtwebengine/src/buildtools/configure_host.pro ) && /usr/bin/make -f Makefile.configure_host
  15. make[3]: Entering directory '/home/florian/code/qt/qt5/qtwebengine/src/webengine/ui2'
  16. make[3]: Nothing to be done for 'first'.
  17. make[3]: Leaving directory '/home/florian/code/qt/qt5/qtwebengine/src/webengine/ui2'
  18. make[4]: Entering directory '/home/florian/code/qt/qt5/qtwebengine/src/buildtools'
  19. make[4]: Nothing to be done for 'first'.
  20. make[4]: Leaving directory '/home/florian/code/qt/qt5/qtwebengine/src/buildtools'
  21. make[4]: Entering directory '/home/florian/code/qt/qt5/qtwebengine/src/buildtools'
  22. make[4]: Nothing to be done for 'first'.
  23. make[4]: Leaving directory '/home/florian/code/qt/qt5/qtwebengine/src/buildtools'
  24. ( test -e Makefile.configure_target || /home/florian/code/qt/qt5/qtbase/bin/qmake -o Makefile.configure_target /home/florian/code/qt/qt5/qtwebengine/src/buildtools/configure_target.pro ) && /usr/bin/make -f Makefile.configure_target
  25. make[4]: Entering directory '/home/florian/code/qt/qt5/qtwebengine/src/buildtools'
  26. make[4]: Nothing to be done for 'first'.
  27. make[4]: Leaving directory '/home/florian/code/qt/qt5/qtwebengine/src/buildtools'
  28. ( test -e Makefile.gn || /home/florian/code/qt/qt5/qtbase/bin/qmake -o Makefile.gn /home/florian/code/qt/qt5/qtwebengine/src/buildtools/gn.pro ) && /usr/bin/make -f Makefile.gn
  29. Building gn manually in a temporary directory for bootstrapping...
  30. ninja: Entering directory `/home/florian/code/qt/qt5/qtwebengine/src/3rdparty/chromium/tools/gn/out/Release'
  31. [197/369] CXX base/files/file_enumerator_posix.o
  32. ../../../../base/files/file_enumerator_posix.cc: In static member function ‘static bool base::FileEnumerator::ReadDirectory(std::vector<base::FileEnumerator::FileInfo>*, const base::FilePath&, bool)’:
  33. ../../../../base/files/file_enumerator_posix.cc:137:41: warning: ‘int readdir_r(DIR*, dirent*, dirent**)’ is deprecated [-Wdeprecated-declarations]
  34.    while (readdir_r(dir, &dent_buf, &dent) == 0 && dent) {
  35.                                          ^
  36. In file included from /usr/include/features.h:423:0,
  37.                  from /usr/include/bits/libc-header-start.h:33,
  38.                  from /usr/include/stdint.h:26,
  39.                  from /usr/lib/gcc/x86_64-pc-linux-gnu/7.2.0/include/stdint.h:9,
  40.                  from ../../../../base/files/file_enumerator.h:9,
  41.                  from ../../../../base/files/file_enumerator_posix.cc:5:
  42. /usr/include/dirent.h:189:12: note: declared here
  43.  extern int __REDIRECT (readdir_r,
  44.             ^
  45. At global scope:
  46. cc1plus: warning: unrecognized command line option ‘-Wno-c++11-narrowing’
  47. [369/369] LINK gn
  48. Building gn using itself to out/Release...
  49. Done. Made 5441 targets from 1229 files in 1933ms
  50. ninja: Entering directory `/home/florian/code/qt/qt5/qtwebengine/src/3rdparty/chromium/tools/gn/out/Release'
  51. [262/478] CXX obj/base/base/file_enumerator_posix.o
  52. ../../../../base/files/file_enumerator_posix.cc: In static member function ‘static bool base::FileEnumerator::ReadDirectory(std::vector<base::FileEnumerator::FileInfo>*, const base::FilePath&, bool)’:
  53. ../../../../base/files/file_enumerator_posix.cc:137:41: warning: ‘int readdir_r(DIR*, dirent*, dirent**)’ is deprecated [-Wdeprecated-declarations]
  54.    while (readdir_r(dir, &dent_buf, &dent) == 0 && dent) {
  55.                                          ^
  56. In file included from /usr/include/features.h:423:0,
  57.                  from /usr/include/bits/libc-header-start.h:33,
  58.                  from /usr/include/stdint.h:26,
  59.                  from /usr/lib/gcc/x86_64-pc-linux-gnu/7.2.0/include/stdint.h:9,
  60.                  from ../../../../base/files/file_enumerator.h:9,
  61.                  from ../../../../base/files/file_enumerator_posix.cc:5:
  62. /usr/include/dirent.h:189:12: note: declared here
  63.  extern int __REDIRECT (readdir_r,
  64.             ^
  65. [478/478] LINK ./gn
  66. make[4]: Entering directory '/home/florian/code/qt/qt5/qtwebengine/src/buildtools'
  67. make[4]: Nothing to be done for 'first'.
  68. make[4]: Leaving directory '/home/florian/code/qt/qt5/qtwebengine/src/buildtools'
  69. make[3]: Leaving directory '/home/florian/code/qt/qt5/qtwebengine/src/buildtools'
  70. cd core/ && ( test -e Makefile || /home/florian/code/qt/qt5/qtbase/bin/qmake -o Makefile /home/florian/code/qt/qt5/qtwebengine/src/core/core.pro ) && /usr/bin/make -f Makefile
  71. make[3]: Entering directory '/home/florian/code/qt/qt5/qtwebengine/src/core'
  72. ( test -e Makefile.core_headers || /home/florian/code/qt/qt5/qtbase/bin/qmake -o Makefile.core_headers /home/florian/code/qt/qt5/qtwebengine/src/core/core_headers.pro ) && /usr/bin/make -f Makefile.core_headers
  73. Project MESSAGE: perl -w /home/florian/code/qt/qt5/qtbase/bin/syncqt.pl -check-includes -module QtWebEngineCore -version 5.11.0 -outdir /home/florian/code/qt/qt5/qtbase /home/florian/code/qt/qt5/qtwebengine
  74. <srcbase> = /home/florian/code/qt/qt5/qtwebengine
  75. <outbase> = /home/florian/code/qt/qt5/qtbase
  76. make[4]: Entering directory '/home/florian/code/qt/qt5/qtwebengine/src/core'
  77. make[4]: Nothing to be done for 'first'.
  78. make[4]: Leaving directory '/home/florian/code/qt/qt5/qtwebengine/src/core'
  79. ( test -e Makefile.core_generator || /home/florian/code/qt/qt5/qtbase/bin/qmake -o Makefile.core_generator /home/florian/code/qt/qt5/qtwebengine/src/core/core_generator.pro ) && /usr/bin/make -f Makefile.core_generator
  80. make[4]: Entering directory '/home/florian/code/qt/qt5/qtwebengine/src/core'
  81. make[4]: Nothing to be done for 'first'.
  82. make[4]: Leaving directory '/home/florian/code/qt/qt5/qtwebengine/src/core'
  83. ( test -e Makefile.gn_run || /home/florian/code/qt/qt5/qtbase/bin/qmake -o Makefile.gn_run /home/florian/code/qt/qt5/qtwebengine/src/core/gn_run.pro ) && /usr/bin/make -f Makefile.gn_run
  84. Project MESSAGE: Running: /home/florian/code/qt/qt5/qtwebengine/src/3rdparty/chromium/tools/gn/out/Release/gn gen /home/florian/code/qt/qt5/qtwebengine/src/core/Debug --script-executable=/usr/bin/python2 --args='use_qt=true is_component_build=false is_shared=true enable_nacl=false enable_remoting=false enable_web_speech=false use_allocator_shim=false use_allocator="none" v8_use_external_startup_data=false treat_warnings_as_errors=false enable_swiftshader=false enable_basic_printing=true enable_print_preview=true enable_pdf=true enable_plugins=true enable_widevine=true enable_spellcheck=true enable_webrtc=true proprietary_codecs=true ffmpeg_branding="Chrome" use_debug_fission=false remove_webcore_debug_symbols=true remove_v8base_debug_symbols=true use_cups=false use_gconf=false use_gio=false use_gnome_keyring=false use_kerberos=false linux_use_bundled_binutils=false use_nss_certs=true use_openssl_certs=false no_delete_null_pointer_checks=true is_clang=false custom_toolchain="/home/florian/code/qt/qt5/qtwebengine/src/toolchain:target" host_toolchain="/home/florian/code/qt/qt5/qtwebengine/src/toolchain:host" host_cpu="x64" pkg_config="pkg-config" host_pkg_config="pkg-config" use_system_zlib=true use_system_minizip=true use_system_libpng=true use_system_libjpeg=true use_system_freetype=true use_system_harfbuzz=true use_pulseaudio=true use_alsa=true use_system_libffi=true use_system_libevent=true use_system_libwebp=true use_system_libxml=true use_system_libxslt=true use_system_opus=true use_system_snappy=true use_system_re2=true use_sysroot=false enable_session_service=false toolkit_views=false qtwebengine_target="/home/florian/code/qt/qt5/qtwebengine/src/core/Debug:QtWebEngineCore"' --root=/home/florian/code/qt/qt5/qtwebengine/src/3rdparty/chromium
  85. ERROR Unresolved dependencies.
  86. /home/florian/code/qt/qt5/qtwebengine/src/core/Debug:qtwebengine_repack_resources(/home/florian/code/qt/qt5/qtwebengine/src/toolchain:target)
  87.   needs //chrome/browser/resources:qt_webengine_resources(/home/florian/code/qt/qt5/qtwebengine/src/toolchain:target)
  88.  
  89. Project ERROR: GN run error!
  90. make[3]: *** [Makefile:80: sub-gn_run-pro-make_first] Error 3
  91. make[3]: Leaving directory '/home/florian/code/qt/qt5/qtwebengine/src/core'
  92. make[2]: *** [Makefile:80: sub-core-make_first] Error 2
  93. make[2]: Leaving directory '/home/florian/code/qt/qt5/qtwebengine/src'
  94. make[1]: *** [Makefile:47: sub-src-make_first] Error 2
  95. make[1]: Leaving directory '/home/florian/code/qt/qt5/qtwebengine'
  96. make: *** [Makefile:257: module-qtwebengine] Error 2
  97.