From anonymous, 1 Year ago, written in Plain Text.
Embed
  1. make[1]: Entering directory '/home/florian/code/qt/qt5/qtwebengine'
  2. cd src/ && ( test -e Makefile || /home/florian/code/qt/qt5/qtbase/bin/qmake -o Makefile /home/florian/code/qt/qt5/qtwebengine/src/src.pro ) && /usr/bin/make -f Makefile
  3. make[2]: Entering directory '/home/florian/code/qt/qt5/qtwebengine/src'
  4. cd buildtools/ && ( test -e Makefile || /home/florian/code/qt/qt5/qtbase/bin/qmake -o Makefile /home/florian/code/qt/qt5/qtwebengine/src/buildtools/buildtools.pro ) && /usr/bin/make -f Makefile
  5. cd webengine/ui/ && ( test -e Makefile || /home/florian/code/qt/qt5/qtbase/bin/qmake -o Makefile /home/florian/code/qt/qt5/qtwebengine/src/webengine/ui/ui.pro ) && /usr/bin/make -f Makefile
  6. cd webengine/ui2/ && ( test -e Makefile || /home/florian/code/qt/qt5/qtbase/bin/qmake -o Makefile /home/florian/code/qt/qt5/qtwebengine/src/webengine/ui2/ui2.pro ) && /usr/bin/make -f Makefile
  7. make[3]: Entering directory '/home/florian/code/qt/qt5/qtwebengine/src/webengine/ui'
  8. make[3]: Nothing to be done for 'first'.
  9. make[3]: Leaving directory '/home/florian/code/qt/qt5/qtwebengine/src/webengine/ui'
  10. make[3]: Entering directory '/home/florian/code/qt/qt5/qtwebengine/src/webengine/ui2'
  11. make[3]: Nothing to be done for 'first'.
  12. make[3]: Leaving directory '/home/florian/code/qt/qt5/qtwebengine/src/webengine/ui2'
  13. make[3]: Entering directory '/home/florian/code/qt/qt5/qtwebengine/src/buildtools'
  14. ( test -e Makefile.ninja || /home/florian/code/qt/qt5/qtbase/bin/qmake -o Makefile.ninja /home/florian/code/qt/qt5/qtwebengine/src/buildtools/ninja.pro ) && /usr/bin/make -f Makefile.ninja
  15. ( test -e Makefile.configure_host || /home/florian/code/qt/qt5/qtbase/bin/qmake -o Makefile.configure_host /home/florian/code/qt/qt5/qtwebengine/src/buildtools/configure_host.pro ) && /usr/bin/make -f Makefile.configure_host
  16. make[4]: Entering directory '/home/florian/code/qt/qt5/qtwebengine/src/buildtools'
  17. make[4]: Nothing to be done for 'first'.
  18. make[4]: Leaving directory '/home/florian/code/qt/qt5/qtwebengine/src/buildtools'
  19. make[4]: Entering directory '/home/florian/code/qt/qt5/qtwebengine/src/buildtools'
  20. make[4]: Nothing to be done for 'first'.
  21. make[4]: Leaving directory '/home/florian/code/qt/qt5/qtwebengine/src/buildtools'
  22. ( test -e Makefile.configure_target || /home/florian/code/qt/qt5/qtbase/bin/qmake -o Makefile.configure_target /home/florian/code/qt/qt5/qtwebengine/src/buildtools/configure_target.pro ) && /usr/bin/make -f Makefile.configure_target
  23. make[4]: Entering directory '/home/florian/code/qt/qt5/qtwebengine/src/buildtools'
  24. make[4]: Nothing to be done for 'first'.
  25. make[4]: Leaving directory '/home/florian/code/qt/qt5/qtwebengine/src/buildtools'
  26. ( test -e Makefile.gn || /home/florian/code/qt/qt5/qtbase/bin/qmake -o Makefile.gn /home/florian/code/qt/qt5/qtwebengine/src/buildtools/gn.pro ) && /usr/bin/make -f Makefile.gn
  27. Building gn manually in a temporary directory for bootstrapping...
  28. ninja: Entering directory `/home/florian/code/qt/qt5/qtwebengine/src/3rdparty/chromium/tools/gn/out/Release'
  29. [195/369] CXX base/files/file_enumerator_posix.o
  30. ../../../../base/files/file_enumerator_posix.cc: In static member function ‘static bool base::FileEnumerator::ReadDirectory(std::vector<base::FileEnumerator::FileInfo>*, const base::FilePath&, bool)’:
  31. ../../../../base/files/file_enumerator_posix.cc:137:41: warning: ‘int readdir_r(DIR*, dirent*, dirent**)’ is deprecated [-Wdeprecated-declarations]
  32.    while (readdir_r(dir, &dent_buf, &dent) == 0 && dent) {
  33.                                          ^
  34. In file included from /usr/include/features.h:423:0,
  35.                  from /usr/include/bits/libc-header-start.h:33,
  36.                  from /usr/include/stdint.h:26,
  37.                  from /usr/lib/gcc/x86_64-pc-linux-gnu/7.2.0/include/stdint.h:9,
  38.                  from ../../../../base/files/file_enumerator.h:9,
  39.                  from ../../../../base/files/file_enumerator_posix.cc:5:
  40. /usr/include/dirent.h:189:12: note: declared here
  41.  extern int __REDIRECT (readdir_r,
  42.             ^
  43. At global scope:
  44. cc1plus: warning: unrecognized command line option ‘-Wno-c++11-narrowing’
  45. [369/369] LINK gn
  46. Building gn using itself to out/Release...
  47. Done. Made 5441 targets from 1229 files in 1972ms
  48. ninja: Entering directory `/home/florian/code/qt/qt5/qtwebengine/src/3rdparty/chromium/tools/gn/out/Release'
  49. [256/478] CXX obj/base/base/file_enumerator_posix.o
  50. ../../../../base/files/file_enumerator_posix.cc: In static member function ‘static bool base::FileEnumerator::ReadDirectory(std::vector<base::FileEnumerator::FileInfo>*, const base::FilePath&, bool)’:
  51. ../../../../base/files/file_enumerator_posix.cc:137:41: warning: ‘int readdir_r(DIR*, dirent*, dirent**)’ is deprecated [-Wdeprecated-declarations]
  52.    while (readdir_r(dir, &dent_buf, &dent) == 0 && dent) {
  53.                                          ^
  54. In file included from /usr/include/features.h:423:0,
  55.                  from /usr/include/bits/libc-header-start.h:33,
  56.                  from /usr/include/stdint.h:26,
  57.                  from /usr/lib/gcc/x86_64-pc-linux-gnu/7.2.0/include/stdint.h:9,
  58.                  from ../../../../base/files/file_enumerator.h:9,
  59.                  from ../../../../base/files/file_enumerator_posix.cc:5:
  60. /usr/include/dirent.h:189:12: note: declared here
  61.  extern int __REDIRECT (readdir_r,
  62.             ^
  63. [478/478] LINK ./gn
  64. make[4]: Entering directory '/home/florian/code/qt/qt5/qtwebengine/src/buildtools'
  65. make[4]: Nothing to be done for 'first'.
  66. make[4]: Leaving directory '/home/florian/code/qt/qt5/qtwebengine/src/buildtools'
  67. make[3]: Leaving directory '/home/florian/code/qt/qt5/qtwebengine/src/buildtools'
  68. cd core/ && ( test -e Makefile || /home/florian/code/qt/qt5/qtbase/bin/qmake -o Makefile /home/florian/code/qt/qt5/qtwebengine/src/core/core.pro ) && /usr/bin/make -f Makefile
  69. make[3]: Entering directory '/home/florian/code/qt/qt5/qtwebengine/src/core'
  70. ( test -e Makefile.core_headers || /home/florian/code/qt/qt5/qtbase/bin/qmake -o Makefile.core_headers /home/florian/code/qt/qt5/qtwebengine/src/core/core_headers.pro ) && /usr/bin/make -f Makefile.core_headers
  71. Project MESSAGE: perl -w /home/florian/code/qt/qt5/qtbase/bin/syncqt.pl -check-includes -module QtWebEngineCore -version 5.11.0 -outdir /home/florian/code/qt/qt5/qtbase /home/florian/code/qt/qt5/qtwebengine
  72. <srcbase> = /home/florian/code/qt/qt5/qtwebengine
  73. <outbase> = /home/florian/code/qt/qt5/qtbase
  74. make[4]: Entering directory '/home/florian/code/qt/qt5/qtwebengine/src/core'
  75. make[4]: Nothing to be done for 'first'.
  76. make[4]: Leaving directory '/home/florian/code/qt/qt5/qtwebengine/src/core'
  77. ( test -e Makefile.core_generator || /home/florian/code/qt/qt5/qtbase/bin/qmake -o Makefile.core_generator /home/florian/code/qt/qt5/qtwebengine/src/core/core_generator.pro ) && /usr/bin/make -f Makefile.core_generator
  78. make[4]: Entering directory '/home/florian/code/qt/qt5/qtwebengine/src/core'
  79. make[4]: Nothing to be done for 'first'.
  80. make[4]: Leaving directory '/home/florian/code/qt/qt5/qtwebengine/src/core'
  81. ( test -e Makefile.gn_run || /home/florian/code/qt/qt5/qtbase/bin/qmake -o Makefile.gn_run /home/florian/code/qt/qt5/qtwebengine/src/core/gn_run.pro ) && /usr/bin/make -f Makefile.gn_run
  82. Project MESSAGE: Running: /home/florian/code/qt/qt5/qtwebengine/src/3rdparty/chromium/tools/gn/out/Release/gn gen /home/florian/code/qt/qt5/qtwebengine/src/core/Debug --script-executable=/usr/bin/python2 --args='use_qt=true is_component_build=false is_shared=true enable_nacl=false enable_remoting=false enable_web_speech=false use_allocator_shim=false use_allocator="none" v8_use_external_startup_data=false treat_warnings_as_errors=false enable_swiftshader=false enable_basic_printing=true enable_print_preview=true enable_pdf=true enable_plugins=true enable_widevine=true enable_spellcheck=true enable_webrtc=true proprietary_codecs=true ffmpeg_branding="Chrome" use_debug_fission=false remove_webcore_debug_symbols=true remove_v8base_debug_symbols=true use_cups=false use_gconf=false use_gio=false use_gnome_keyring=false use_kerberos=false linux_use_bundled_binutils=false use_nss_certs=true use_openssl_certs=false no_delete_null_pointer_checks=true is_clang=false custom_toolchain="/home/florian/code/qt/qt5/qtwebengine/src/toolchain:target" host_toolchain="/home/florian/code/qt/qt5/qtwebengine/src/toolchain:host" host_cpu="x64" pkg_config="pkg-config" host_pkg_config="pkg-config" use_system_zlib=true use_system_minizip=true use_system_libpng=true use_system_libjpeg=true use_system_freetype=true use_system_harfbuzz=true use_pulseaudio=true use_alsa=true use_system_libffi=true use_system_libevent=true use_system_libwebp=true use_system_libxml=true use_system_libxslt=true use_system_opus=true use_system_snappy=true use_system_re2=true use_sysroot=false enable_session_service=false toolkit_views=false qtwebengine_target="/home/florian/code/qt/qt5/qtwebengine/src/core/Debug:QtWebEngineCore"' --root=/home/florian/code/qt/qt5/qtwebengine/src/3rdparty/chromium
  83. ERROR Unresolved dependencies.
  84. /home/florian/code/qt/qt5/qtwebengine/src/core/Debug:qtwebengine_repack_resources(/home/florian/code/qt/qt5/qtwebengine/src/toolchain:target)
  85.   needs //chrome/browser/resources:qt_webengine_resources(/home/florian/code/qt/qt5/qtwebengine/src/toolchain:target)
  86.  
  87. Project ERROR: GN run error!
  88. make[3]: *** [Makefile:80: sub-gn_run-pro-make_first] Error 3
  89. make[3]: Leaving directory '/home/florian/code/qt/qt5/qtwebengine/src/core'
  90. make[2]: *** [Makefile:80: sub-core-make_first] Error 2
  91. make[2]: Leaving directory '/home/florian/code/qt/qt5/qtwebengine/src'
  92. make[1]: *** [Makefile:47: sub-src-make_first] Error 2
  93. make[1]: Leaving directory '/home/florian/code/qt/qt5/qtwebengine'
  94. make: *** [Makefile:257: module-qtwebengine] Error 2
  95.