From sorin, 5 Months ago, written in Plain Text.
This paste will croak in 1 Second.
This paste is a reply to qutebrowser metapaste from The Compiler
- view diff
Embed
  1. ========== Report ==========
  2.  
  3.  
  4.  
  5. ========== Contact ==========
  6.  
  7.  
  8.  
  9. ========== Debug log ==========
  10.  
  11. ==== Exception ====
  12. Traceback (most recent call last):
  13.   File "/usr/lib/python-exec/python3.4/qutebrowser", line 11, in <module>
  14.     load_entry_point('qutebrowser==0.9.1', 'gui_scripts', 'qutebrowser')()
  15.   File "/usr/lib64/python3.4/site-packages/qutebrowser/qutebrowser.py", line 169, in main
  16.     return app.run(args)
  17.   File "/usr/lib64/python3.4/site-packages/qutebrowser/app.py", line 98, in run
  18.     server = ipc.send_or_listen(args)
  19.   File "/usr/lib64/python3.4/site-packages/qutebrowser/misc/ipc.py", line 525, in send_or_listen
  20.     socketname = _get_socketname(args.basedir)
  21.   File "/usr/lib64/python3.4/site-packages/qutebrowser/misc/ipc.py", line 65, in _get_socketname
  22.     target_dir = standarddir.runtime()
  23.   File "/usr/lib64/python3.4/site-packages/qutebrowser/utils/standarddir.py", line 134, in runtime
  24.     _create(path)
  25.   File "/usr/lib64/python3.4/site-packages/qutebrowser/utils/standarddir.py", line 193, in _create
  26.     os.makedirs(path, 0o700)
  27.   File "/usr/lib64/python3.4/os.py", line 237, in makedirs
  28.     mkdir(name, mode)
  29. OSError: [Errno 30] Read-only file system: '/tmp/qutebrowser'
  30.  
  31.  
  32. ==== Timestamps ====
  33. Launch: Sat Jun 16 09:52:07 2018
  34. Crash: Sat Jun 16 09:52:08 2018
  35.  
  36. ==== Version info ====
  37. Traceback (most recent call last):
  38.   File "/usr/lib64/python3.4/site-packages/qutebrowser/misc/crashdialog.py", line 253, in _gather_crash_info
  39.     self._crash_info.append(("Version info", version.version()))
  40.   File "/usr/lib64/python3.4/site-packages/qutebrowser/utils/version.py", line 279, in version
  41.     for name, path in _path_info().items():
  42.   File "/usr/lib64/python3.4/site-packages/qutebrowser/utils/version.py", line 167, in _path_info
  43.     'runtime': standarddir.runtime(),
  44.   File "/usr/lib64/python3.4/site-packages/qutebrowser/utils/standarddir.py", line 134, in runtime
  45.     _create(path)
  46.   File "/usr/lib64/python3.4/site-packages/qutebrowser/utils/standarddir.py", line 193, in _create
  47.     os.makedirs(path, 0o700)
  48.   File "/usr/lib64/python3.4/os.py", line 237, in makedirs
  49.     mkdir(name, mode)
  50. OSError: [Errno 30] Read-only file system: '/tmp/qutebrowser'
  51.  
  52.  
  53. ==== Config ====
  54. Traceback (most recent call last):
  55.   File "/usr/lib64/python3.4/site-packages/qutebrowser/misc/crashdialog.py", line 257, in _gather_crash_info
  56.     conf = objreg.get('config')
  57.   File "/usr/lib64/python3.4/site-packages/qutebrowser/utils/objreg.py", line 233, in get
  58.     return reg[name]
  59.   File "/usr/lib64/python3.4/collections/__init__.py", line 913, in __getitem__
  60.     raise KeyError(key)
  61. KeyError: 'config'
  62.  
  63.  
  64. ==== Environment ====
  65. LANG = en_US.UTF-8
  66. LC_COLLATE = POSIX
  67. PATH = /usr/local/bin:/usr/bin:/bin:/opt/bin:/usr/x86_64-pc-linux-gnu/gcc-bin/5.3.0
  68. QT_GRAPHICSSYSTEM = raster
  69. XDG_CONFIG_DIRS = /etc/xdg
  70. XDG_DATA_DIRS = /usr/local/share:/usr/share
  71. XDG_SESSION_COOKIE = myfbox-1529128401.146128-1235232848
  72.  
  73. ==== Commandline args ====
  74.  
  75.  
  76. ==== Open Pages ====
  77.  
  78.  
  79. ==== Command history ====
  80.  
  81.  
  82. ==== Objects ====
  83.  
  84. Qt widgets - 0 objects:
  85.  
  86. Qt objects - 5 objects:
  87.     <PyQt5.QtCore.QAbstractEventDispatcher object at 0x7f2cc865dd38>
  88.     <PyQt5.QtGui.QSessionManager object at 0x7f2cc48d4168>
  89.     <qutebrowser.misc.crashsignal.CrashHandler object at 0x7f2cca890168>
  90.     <qutebrowser.misc.crashsignal.SignalHandler object at 0x7f2cca890558>
  91.         <PyQt5.QtCore.QSocketNotifier object at 0x7f2cca8908b8>
  92.  
  93. global object registry - 5 objects:
  94.     quitter: <qutebrowser.app.Quitter object at 0x7f2cc9d37358>
  95.     signal-handler: <qutebrowser.misc.crashsignal.SignalHandler object at 0x7f2cca890558>
  96.     crash-handler: <qutebrowser.misc.crashsignal.CrashHandler object at 0x7f2cca890168>
  97.     app: <qutebrowser.app.Application>
  98.     args: Namespace(backend='webkit', basedir=None, color=True, command=[], debug=False, debug_exit=False, enable_webengine_inspector=False, force_color=False, harfbuzz='auto', json_args=None, json_logging=False, logfilter=None, loglevel='info', loglines=2000, no_err_windows=False, nowindow=False, override_restore=False, pdb_postmortem=False, qt_arg=None, qt_flag=None, relaxed_config=False, session=None, target=None, temp_basedir=False, temp_basedir_restarted=None, temp_settings=[], url=[], version=False)
  99.  
  100. ==== Debug log ====
  101. 09:52:04 DEBUG    init       earlyinit:init_log:327 Log initialized.
  102. 09:52:04 DEBUG    init       earlyinit:fix_harfbuzz:203 Using system harfbuzz engine (auto)
  103. 09:52:07 DEBUG    init       app:__init__:751 Qt arguments: ['/usr/lib/python-exec/python3.4/qutebrowser'], based on Namespace(backend='webkit', basedir=None, color=True, command=[], debug=False, debug_exit=False, enable_webengine_inspector=False, force_color=False, harfbuzz='auto', json_args=None, json_logging=False, logfilter=None, loglevel='info', loglines=2000, no_err_windows=False, nowindow=False, override_restore=False, pdb_postmortem=False, qt_arg=None, qt_flag=None, relaxed_config=False, session=None, target=None, temp_basedir=False, temp_basedir_restarted=None, temp_settings=[], url=[], version=False)
  104. 09:52:07 DEBUG    init       app:__init__:754 Initializing application...
  105. 09:52:07 DEBUG    init       app:run:80 Initializing directories...
  106. 09:52:07 DEBUG    init       standarddir:init:203 Base directory: None
  107. 09:52:07 DEBUG    misc       standarddir:_writable_location:143 writable location for CacheLocation: /home/sorin/.cache/qutebrowser
  108. 09:52:07 DEBUG    misc       standarddir:_writable_location:143 writable location for AppLocalDataLocation: /home/sorin/.local/share/qutebrowser
  109. 09:52:07 DEBUG    misc       standarddir:_writable_location:143 writable location for CacheLocation: /home/sorin/.cache/qutebrowser
  110. 09:52:07 WARNING  qt         Unknown module:none:0 QStandardPaths: error creating runtime directory /tmp/runtime-sorin: Read-only file system
  111.   File "/usr/lib/python-exec/python3.4/qutebrowser", line 11, in <module>
  112.     load_entry_point('qutebrowser==0.9.1', 'gui_scripts', 'qutebrowser')()
  113.   File "/usr/lib64/python3.4/site-packages/qutebrowser/qutebrowser.py", line 169, in main
  114.     return app.run(args)
  115.   File "/usr/lib64/python3.4/site-packages/qutebrowser/app.py", line 98, in run
  116.     server = ipc.send_or_listen(args)
  117.   File "/usr/lib64/python3.4/site-packages/qutebrowser/misc/ipc.py", line 525, in send_or_listen
  118.     socketname = _get_socketname(args.basedir)
  119.   File "/usr/lib64/python3.4/site-packages/qutebrowser/misc/ipc.py", line 65, in _get_socketname
  120.     target_dir = standarddir.runtime()
  121.   File "/usr/lib64/python3.4/site-packages/qutebrowser/utils/standarddir.py", line 117, in runtime
  122.     path = _writable_location(typ)
  123.   File "/usr/lib64/python3.4/site-packages/qutebrowser/utils/standarddir.py", line 141, in _writable_location
  124.     path = QStandardPaths.writableLocation(typ)
  125.   File "/usr/lib64/python3.4/site-packages/qutebrowser/utils/log.py", line 457, in qt_message_handler
  126.     stack = ''.join(traceback.format_stack())
  127.  
  128. 09:52:07 DEBUG    misc       standarddir:_writable_location:143 writable location for RuntimeLocation:
  129. 09:52:07 DEBUG    misc       standarddir:_writable_location:143 writable location for TempLocation: /tmp
  130. 09:52:07 ERROR    misc       crashsignal:exception_hook:205 Uncaught exception
  131. Traceback (most recent call last):
  132.   File "/usr/lib/python-exec/python3.4/qutebrowser", line 11, in <module>
  133.     load_entry_point('qutebrowser==0.9.1', 'gui_scripts', 'qutebrowser')()
  134.   File "/usr/lib64/python3.4/site-packages/qutebrowser/qutebrowser.py", line 169, in main
  135.     return app.run(args)
  136.   File "/usr/lib64/python3.4/site-packages/qutebrowser/app.py", line 98, in run
  137.     server = ipc.send_or_listen(args)
  138.   File "/usr/lib64/python3.4/site-packages/qutebrowser/misc/ipc.py", line 525, in send_or_listen
  139.     socketname = _get_socketname(args.basedir)
  140.   File "/usr/lib64/python3.4/site-packages/qutebrowser/misc/ipc.py", line 65, in _get_socketname
  141.     target_dir = standarddir.runtime()
  142.   File "/usr/lib64/python3.4/site-packages/qutebrowser/utils/standarddir.py", line 134, in runtime
  143.     _create(path)
  144.   File "/usr/lib64/python3.4/site-packages/qutebrowser/utils/standarddir.py", line 193, in _create
  145.     os.makedirs(path, 0o700)
  146.   File "/usr/lib64/python3.4/os.py", line 237, in makedirs
  147.     mkdir(name, mode)
  148. OSError: [Errno 30] Read-only file system: '/tmp/qutebrowser'
  149. 09:52:07 ERROR    destroy    crashsignal:_get_exception_info:181 Error while getting history: {}
  150. Traceback (most recent call last):
  151.   File "/usr/lib64/python3.4/site-packages/qutebrowser/misc/crashsignal.py", line 179, in _get_exception_info
  152.     cmd_history = objreg.get('command-history')[-5:]
  153.   File "/usr/lib64/python3.4/site-packages/qutebrowser/utils/objreg.py", line 233, in get
  154.     return reg[name]
  155.   File "/usr/lib64/python3.4/collections/__init__.py", line 913, in __getitem__
  156.     raise KeyError(key)
  157. KeyError: 'command-history'
  158. 09:52:08 ERROR    destroy    crashsignal:exception_hook:230 Error while ignoring ipc
  159. Traceback (most recent call last):
  160.   File "/usr/lib64/python3.4/site-packages/qutebrowser/misc/crashsignal.py", line 228, in exception_hook
  161.     objreg.get('ipc-server').ignored = True
  162.   File "/usr/lib64/python3.4/site-packages/qutebrowser/utils/objreg.py", line 233, in get
  163.     return reg[name]
  164.   File "/usr/lib64/python3.4/collections/__init__.py", line 913, in __getitem__
  165.     raise KeyError(key)
  166. KeyError: 'ipc-server'
  167. 09:52:08 ERROR    misc       crashdialog:__init__:166 Failed to get contact information!
  168. Traceback (most recent call last):
  169.   File "/usr/lib64/python3.4/site-packages/qutebrowser/misc/crashdialog.py", line 160, in __init__
  170.     state = objreg.get('state-config')
  171.   File "/usr/lib64/python3.4/site-packages/qutebrowser/utils/objreg.py", line 233, in get
  172.     return reg[name]
  173.   File "/usr/lib64/python3.4/collections/__init__.py", line 913, in __getitem__
  174.     raise KeyError(key)
  175. KeyError: 'state-config'
  176. 09:52:08 ERROR    misc       crashdialog:_init_checkboxes:437 Error while checking private browsing mode
  177. Traceback (most recent call last):
  178.   File "/usr/lib64/python3.4/site-packages/qutebrowser/misc/crashdialog.py", line 434, in _init_checkboxes
  179.     if config.get('general', 'private-browsing'):
  180.   File "/usr/lib64/python3.4/site-packages/qutebrowser/config/config.py", line 129, in get
  181.     return objreg.get('config').get(*args, **kwargs)
  182.   File "/usr/lib64/python3.4/site-packages/qutebrowser/utils/objreg.py", line 233, in get
  183.     return reg[name]
  184.   File "/usr/lib64/python3.4/collections/__init__.py", line 913, in __getitem__
  185.     raise KeyError(key)
  186. KeyError: 'config'
  187. 09:52:08 DEBUG    misc       standarddir:_writable_location:143 writable location for ConfigLocation: /home/sorin/.config
  188. 09:52:08 DEBUG    misc       standarddir:_writable_location:143 writable location for AppLocalDataLocation: /home/sorin/.local/share/qutebrowser
  189. 09:52:08 DEBUG    misc       standarddir:_writable_location:143 writable location for AppLocalDataLocation: /home/sorin/.local/share/qutebrowser
  190. 09:52:08 DEBUG    misc       standarddir:_writable_location:143 writable location for CacheLocation: /home/sorin/.cache/qutebrowser
  191. 09:52:08 DEBUG    misc       standarddir:_writable_location:143 writable location for DownloadLocation: /home/sorin/Downloads
  192. 09:52:08 WARNING  qt         Unknown module:none:0 QStandardPaths: error creating runtime directory /tmp/runtime-sorin: Read-only file system
  193.   File "/usr/lib64/python3.4/site-packages/qutebrowser/misc/crashsignal.py", line 248, in exception_hook
  194.     info.objects)
  195.   File "/usr/lib64/python3.4/site-packages/qutebrowser/misc/crashdialog.py", line 418, in __init__
  196.     self._set_crash_info()
  197.   File "/usr/lib64/python3.4/site-packages/qutebrowser/misc/crashdialog.py", line 269, in _set_crash_info
  198.     self._gather_crash_info()
  199.   File "/usr/lib64/python3.4/site-packages/qutebrowser/misc/crashdialog.py", line 457, in _gather_crash_info
  200.     super()._gather_crash_info()
  201.   File "/usr/lib64/python3.4/site-packages/qutebrowser/misc/crashdialog.py", line 253, in _gather_crash_info
  202.     self._crash_info.append(("Version info", version.version()))
  203.   File "/usr/lib64/python3.4/site-packages/qutebrowser/utils/version.py", line 279, in version
  204.     for name, path in _path_info().items():
  205.   File "/usr/lib64/python3.4/site-packages/qutebrowser/utils/version.py", line 167, in _path_info
  206.     'runtime': standarddir.runtime(),
  207.   File "/usr/lib64/python3.4/site-packages/qutebrowser/utils/standarddir.py", line 117, in runtime
  208.     path = _writable_location(typ)
  209.   File "/usr/lib64/python3.4/site-packages/qutebrowser/utils/standarddir.py", line 141, in _writable_location
  210.     path = QStandardPaths.writableLocation(typ)
  211.   File "/usr/lib64/python3.4/site-packages/qutebrowser/utils/log.py", line 457, in qt_message_handler
  212.     stack = ''.join(traceback.format_stack())
  213.  
  214. 09:52:08 DEBUG    misc       standarddir:_writable_location:143 writable location for RuntimeLocation:
  215. 09:52:08 DEBUG    misc       standarddir:_writable_location:143 writable location for TempLocation: /tmp