From tony, 2 Months ago, written in Plain Text.
This paste will go to its last resting place in 1 Second.
This paste is a reply to qutebrowser metapaste from The Compiler
- view diff
Embed
  1. ========== Report ==========
  2.  
  3.  
  4.  
  5. ========== Contact ==========
  6.  
  7.  
  8.  
  9. ========== Debug log ==========
  10.  
  11. ==== Exception ====
  12. Traceback (most recent call last):
  13.   File "/usr/lib/python-exec/python3.4/qutebrowser", line 11, in <module>
  14.     load_entry_point('qutebrowser==0.2.1', 'gui_scripts', 'qutebrowser')()
  15.   File "/usr/lib64/python3.4/site-packages/qutebrowser/qutebrowser.py", line 142, in main
  16.     app = app.Application(args)
  17.   File "/usr/lib64/python3.4/site-packages/qutebrowser/app.py", line 142, in __init__
  18.     self._init_modules()
  19.   File "/usr/lib64/python3.4/site-packages/qutebrowser/app.py", line 189, in _init_modules
  20.     config.init(self)
  21.   File "/usr/lib64/python3.4/site-packages/qutebrowser/config/config.py", line 233, in init
  22.     _init_main_config(parent)
  23.   File "/usr/lib64/python3.4/site-packages/qutebrowser/config/config.py", line 125, in _init_main_config
  24.     args.relaxed_config, parent=parent)
  25.   File "/usr/lib64/python3.4/site-packages/qutebrowser/config/config.py", line 311, in __init__
  26.     self._validate_all()
  27.   File "/usr/lib64/python3.4/site-packages/qutebrowser/config/config.py", line 466, in _validate_all
  28.     self, sectname, optname, opt.value(), mapping)
  29.   File "/usr/lib64/python3.4/configparser.py", line 432, in before_get
  30.     self._interpolate_some(parser, option, L, value, section, defaults, 1)
  31.   File "/usr/lib64/python3.4/configparser.py", line 445, in _interpolate_some
  32.     rawval = parser.get(section, option, raw=True, fallback=rest)
  33.   File "/usr/lib64/python3.4/functools.py", line 472, in wrapper
  34.     result = user_function(*args, **kwds)
  35. TypeError: get() got an unexpected keyword argument 'fallback'
  36.  
  37.  
  38. ==== Version info ====
  39. qutebrowser v0.2.1
  40. Git commit:
  41.  
  42. CPython: 3.4.8
  43. Qt: 5.11.3, runtime: 5.11.3
  44. PyQt: 5.10.1
  45. SIP: 4.19.13
  46. colorlog: no
  47. colorama: no
  48. pypeg2: 2.15
  49. jinja2: 2.10
  50. pygments: 2.2.0
  51. yaml: 3.13
  52. Webkit: 602.1
  53. Harfbuzz: old
  54. SSL: OpenSSL 1.0.2q  20 Nov 2018
  55.  
  56. Frozen: False
  57. Platform: Linux-4.14.83-gentoo-x86_64-Intel-R-_Core-TM-_i9-9900K_CPU_@_3.60GHz-with-gentoo-2.6, 64bit
  58. OS Version: gentoo, 2.6
  59.  
  60. --- /etc/gentoo-release ---
  61. Gentoo Base System release 2.6
  62.  
  63.  
  64. --- /etc/os-release ---
  65. NAME=Gentoo
  66. ID=gentoo
  67. PRETTY_NAME="Gentoo/Linux"
  68. ANSI_COLOR="1;32"
  69. HOME_URL="https://www.gentoo.org/"
  70. SUPPORT_URL="https://www.gentoo.org/support/"
  71. BUG_REPORT_URL="https://bugs.gentoo.org/"
  72.  
  73.  
  74. ==== Config ====
  75. Traceback (most recent call last):
  76.   File "/usr/lib64/python3.4/site-packages/qutebrowser/misc/crashdialog.py", line 228, in _gather_crash_info
  77.     conf = objreg.get('config')
  78.   File "/usr/lib64/python3.4/site-packages/qutebrowser/utils/objreg.py", line 217, in get
  79.     return reg[name]
  80.   File "/usr/lib64/python3.4/collections/__init__.py", line 913, in __getitem__
  81.     raise KeyError(key)
  82. KeyError: 'config'
  83.  
  84.  
  85. ==== Commandline args ====
  86. --json-args {"qt_style": null, "session": null, "debug": false, "no_crash_dialog": false, "override_restore": true, "logfilter": null, "qt_widgetcount": null, "confdir": null, "command": [], "pdb_postmortem": false, "nowindow": false, "version": false, "qt_reverse": null, "debug_exit": false, "harfbuzz": "auto", "url": [], "loglevel": "info", "color": true, "qt_qmljsdebugger": null, "qt_name": null, "temp_settings": [], "json_args": null, "loglines": 2000, "relaxed_config": false, "qt_stylesheet": null}
  87.  
  88. ==== Open Pages ====
  89.  
  90.  
  91. ==== Command history ====
  92.  
  93.  
  94. ==== Objects ====
  95.  
  96. Qt widgets - 0 objects
  97. Qt objects - 16 objects:
  98.     <PyQt5.QtCore.QAbstractEventDispatcher object at 0x7f15b8c19af8>
  99.     <PyQt5.QtGui.QSessionManager object at 0x7f15a29de0d8>
  100.     <PyQt5.QtWidgets.QCommonStyle object at 0x7f15a29de168>
  101.     <qutebrowser.misc.ipc.IPCServer object at 0x7f15a89acca8>
  102.         <qutebrowser.utils.usertypes.Timer name='ipc-timeout'>
  103.         <PyQt5.QtNetwork.QLocalServer object at 0x7f15b8c0bdc8>
  104.             <PyQt5.QtCore.QSocketNotifier object at 0x7f15a29de1f8>
  105.         <PyQt5.QtCore.QSocketNotifier object at 0x7f15a29de1f8>
  106.     <qutebrowser.utils.usertypes.Timer name='ipc-timeout'>
  107.     <PyQt5.QtNetwork.QLocalServer object at 0x7f15b8c0bdc8>
  108.         <PyQt5.QtCore.QSocketNotifier object at 0x7f15a29de1f8>
  109.     <PyQt5.QtCore.QSocketNotifier object at 0x7f15a29de1f8>
  110.     <qutebrowser.misc.savemanager.SaveManager saveables=OrderedDict([('window-geometry', <qutebrowser.misc.savemanager.Saveable filename=None name='window-geometry' dirty=False save_on_exit=True save_handler=<bound method Application._save_geometry of <qutebrowser.app.Application>> config_opt=None>), ('version', <qutebrowser.misc.savemanager.Saveable filename=None name='version' dirty=False save_on_exit=True save_handler=<bound method Application._save_version of <qutebrowser.app.Application>> config_opt=None>)])>
  111.         <qutebrowser.utils.usertypes.Timer name='save-timer'>
  112.     <qutebrowser.utils.usertypes.Timer name='save-timer'>
  113.     <qutebrowser.config.config.ConfigManager fname='qutebrowser.conf'>
  114.  
  115.  
  116. global object registry - 5 objects:
  117.     save-manager: <qutebrowser.misc.savemanager.SaveManager saveables=OrderedDict([('window-geometry', <qutebrowser.misc.savemanager.Saveable filename=None name='window-geometry' dirty=False save_on_exit=True save_handler=<bound method Application._save_geometry of <qutebrowser.app.Application>> config_opt=None>), ('version', <qutebrowser.misc.savemanager.Saveable filename=None name='version' dirty=False save_on_exit=True save_handler=<bound method Application._save_version of <qutebrowser.app.Application>> config_opt=None>)])>
  118.     readline-bridge: <qutebrowser.misc.readline.ReadlineBridge>
  119.     args: Namespace(color=True, command=[], confdir=None, debug=False, debug_exit=False, harfbuzz='auto', json_args=None, logfilter=None, loglevel='info', loglines=2000, no_crash_dialog=False, nowindow=False, override_restore=True, pdb_postmortem=False, qt_name=None, qt_qmljsdebugger=None, qt_reverse=None, qt_style=None, qt_stylesheet=None, qt_widgetcount=None, relaxed_config=False, session=None, temp_settings=[], url=[], version=False)
  120.     app: <qutebrowser.app.Application>
  121.     ipc-server: <qutebrowser.misc.ipc.IPCServer object at 0x7f15a89acca8>
  122.  
  123. ==== Debug log ====
  124. 19:45:01 DEBUG    init       earlyinit:init_log:262 Log initialized.
  125. 19:45:01 DEBUG    init       app:__init__:95 Qt arguments: ['/usr/lib/python-exec/python3.4/qutebrowser'], based on Namespace(color=True, command=[], confdir=None, debug=False, debug_exit=False, harfbuzz='auto', json_args=None, logfilter=None, loglevel='info', loglines=2000, no_crash_dialog=False, nowindow=False, override_restore=True, pdb_postmortem=False, qt_name=None, qt_qmljsdebugger=None, qt_reverse=None, qt_style=None, qt_stylesheet=None, qt_widgetcount=None, relaxed_config=False, session=None, temp_settings=[], url=[], version=False)
  126. 19:45:01 DEBUG    ipc        ipc:send_to_running_instance:266 No existing instance present (error 0)
  127. 19:45:01 DEBUG    init       app:__init__:117 Starting IPC server...
  128. 19:45:01 DEBUG    init       app:__init__:134 Starting init...
  129. 19:45:01 DEBUG    init       app:_init_modules:176 Initializing save manager...
  130. 19:45:01 DEBUG    init       app:_init_modules:181 Initializing network...
  131. 19:45:01 DEBUG    init       app:_init_modules:183 Initializing readline-bridge...
  132. 19:45:01 DEBUG    init       app:_init_modules:186 Initializing directories...
  133. 19:45:01 DEBUG    init       app:_init_modules:188 Initializing config...
  134. 19:45:01 ERROR    misc       app:_exception_hook:612 Uncaught exception
  135. Traceback (most recent call last):
  136.   File "/usr/lib/python-exec/python3.4/qutebrowser", line 11, in <module>
  137.     load_entry_point('qutebrowser==0.2.1', 'gui_scripts', 'qutebrowser')()
  138.   File "/usr/lib64/python3.4/site-packages/qutebrowser/qutebrowser.py", line 142, in main
  139.     app = app.Application(args)
  140.   File "/usr/lib64/python3.4/site-packages/qutebrowser/app.py", line 142, in __init__
  141.     self._init_modules()
  142.   File "/usr/lib64/python3.4/site-packages/qutebrowser/app.py", line 189, in _init_modules
  143.     config.init(self)
  144.   File "/usr/lib64/python3.4/site-packages/qutebrowser/config/config.py", line 233, in init
  145.     _init_main_config(parent)
  146.   File "/usr/lib64/python3.4/site-packages/qutebrowser/config/config.py", line 125, in _init_main_config
  147.     args.relaxed_config, parent=parent)
  148.   File "/usr/lib64/python3.4/site-packages/qutebrowser/config/config.py", line 311, in __init__
  149.     self._validate_all()
  150.   File "/usr/lib64/python3.4/site-packages/qutebrowser/config/config.py", line 466, in _validate_all
  151.     self, sectname, optname, opt.value(), mapping)
  152.   File "/usr/lib64/python3.4/configparser.py", line 432, in before_get
  153.     self._interpolate_some(parser, option, L, value, section, defaults, 1)
  154.   File "/usr/lib64/python3.4/configparser.py", line 445, in _interpolate_some
  155.     rawval = parser.get(section, option, raw=True, fallback=rest)
  156.   File "/usr/lib64/python3.4/functools.py", line 472, in wrapper
  157.     result = user_function(*args, **kwds)
  158. TypeError: get() got an unexpected keyword argument 'fallback'
  159. 19:45:01 ERROR    destroy    app:_exception_hook:643 Error while getting history: {}
  160. Traceback (most recent call last):
  161.   File "/usr/lib64/python3.4/site-packages/qutebrowser/app.py", line 641, in _exception_hook
  162.     cmd_history = objreg.get('command-history')[-5:]
  163.   File "/usr/lib64/python3.4/site-packages/qutebrowser/utils/objreg.py", line 217, in get
  164.     return reg[name]
  165.   File "/usr/lib64/python3.4/collections/__init__.py", line 913, in __getitem__
  166.     raise KeyError(key)
  167. KeyError: 'command-history'
  168. 19:45:01 ERROR    destroy    app:_exception_hook:660 Error while preventing shutdown
  169. Traceback (most recent call last):
  170.   File "/usr/lib64/python3.4/site-packages/qutebrowser/app.py", line 658, in _exception_hook
  171.     self.lastWindowClosed.disconnect(self.on_last_window_closed)
  172. TypeError: disconnect() failed between 'lastWindowClosed' and 'on_last_window_closed'
  173. 19:45:01 ERROR    misc       crashdialog:__init__:147 Failed to get contact information!
  174. Traceback (most recent call last):
  175.   File "/usr/lib64/python3.4/site-packages/qutebrowser/misc/crashdialog.py", line 141, in __init__
  176.     state = objreg.get('state-config')
  177.   File "/usr/lib64/python3.4/site-packages/qutebrowser/utils/objreg.py", line 217, in get
  178.     return reg[name]
  179.   File "/usr/lib64/python3.4/collections/__init__.py", line 913, in __getitem__
  180.     raise KeyError(key)
  181. KeyError: 'state-config'
  182. 19:45:01 ERROR    misc       crashdialog:_init_checkboxes:409 Error while checking private browsing mode
  183. Traceback (most recent call last):
  184.   File "/usr/lib64/python3.4/site-packages/qutebrowser/misc/crashdialog.py", line 406, in _init_checkboxes
  185.     if config.get('general', 'private-browsing'):
  186.   File "/usr/lib64/python3.4/site-packages/qutebrowser/config/config.py", line 108, in get
  187.     return objreg.get('config').get(*args, **kwargs)
  188.   File "/usr/lib64/python3.4/site-packages/qutebrowser/utils/objreg.py", line 217, in get
  189.     return reg[name]
  190.   File "/usr/lib64/python3.4/collections/__init__.py", line 913, in __getitem__
  191.     raise KeyError(key)
  192. KeyError: 'config'