From anonymous, 5 Months ago, written in Plain Text.
Embed
  1. FAILED tests/end2end/test_invocations.py::test_no_loglines
  2. FAILED tests/end2end/features/test_completion_bdd.py::test_deleting_an_open_tab_via_the_completion
  3. FAILED tests/end2end/features/test_completion_bdd.py::test_go_to_tab_after_moving_a_tab
  4. FAILED tests/end2end/features/test_editor_bdd.py::test_editing_a_url
  5. FAILED tests/end2end/features/test_editor_bdd.py::test_editing_a_url_with_rt
  6. FAILED tests/end2end/features/test_editor_bdd.py::test_spawning_an_editor_in_caret_mode
  7. FAILED tests/end2end/features/test_prompts_bdd.py::test_javascript_alert
  8. FAILED tests/end2end/features/test_spawn_bdd.py::test_running_spawn_with_url_variable
  9. FAILED tests/end2end/features/test_spawn_bdd.py::test_running_spawn_with_userscript
  10. FAILED tests/end2end/features/test_tabs_bdd.py::test_buffer_with_matching_title_and_two_windows
  11. FAILED tests/end2end/features/test_urlmarks_bdd.py::test_loading_a_quickmark
  12. FAILED tests/unit/misc/test_ipc.py::TestSocketName::test_mac[None-ipc-63f07f77469288baa4d944efc2d2a738]
  13. FAILED tests/unit/misc/test_ipc.py::TestSocketName::test_mac[/x-ipc-e254b27d63e754c98d01ebd5c2953f14]
  14. FAILED tests/unit/misc/test_ipc.py::TestSendOrListen::test_correct_socket_name